Quantcast

Ubuntu build fail

classic Classic list List threaded Threaded
19 messages Options
Reply | Threaded
Open this post in threaded view
|  
Report Content as Inappropriate

Ubuntu build fail

lunar-lou
As predicted.. here is my terminal readout.. What did i do wrong?   Thanks


ss@ss:~$ mkdir build
ss@ss:~$ cd build
ss@ss:~/build$ cmake -DCMAKE_PREFIX_PATH= /home/ss/Qt/5.3
CMake Error: The source directory "/home/ss/Qt/5.3" does not appear to contain CMakeLists.txt.
Specify --help for usage, or press the help button on the CMake GUI.
ss@ss:~/build$ cmake -DCMAKE_PREFIX_PATH=/home/ss/Qt/5.3/gcc_64/
CMake Error: The source directory "/home/ss/build" does not appear to contain CMakeLists.txt.
Specify --help for usage, or press the help button on the CMake GUI.
ss@ss:~/build$ cmake -DCMAKE_PREFIX_PATH=/home/ss/Qt/5.3/gcc_64/
-- The C compiler identification is GNU 5.4.0
-- The CXX compiler identification is GNU 5.4.0
-- Check for working C compiler: /usr/bin/cc
-- Check for working C compiler: /usr/bin/cc -- works
-- Detecting C compiler ABI info
-- Detecting C compiler ABI info - done
-- Detecting C compile features
-- Detecting C compile features - done
-- Check for working CXX compiler: /usr/bin/c++
-- Check for working CXX compiler: /usr/bin/c++ -- works
-- Detecting CXX compiler ABI info
-- Detecting CXX compiler ABI info - done
-- Detecting CXX compile features
-- Detecting CXX compile features - done
-- SuperCollider Version: 3.8.0
-- Building from branch not_a_git_checkout, commit hash is na
-- Build type defaulting to "RelWithDebInfo"
CMake Warning at CMakeLists.txt:29 (message):
  WARNING: IN-PLACE BUILDS ARE NOT RECOMMENDED - PLEASE USE A BUILD DIRECTORY


-- Compiling with Qt GUI
-- Found Pthreads: /usr/lib/x86_64-linux-gnu/libpthread.so  
-- building boost libraries manually
-- using bundled libyaml-cpp
-- HIDAPI components:
-- linux hidraw
-- libudev stable: 1
-- Found UDev: /usr/lib/x86_64-linux-gnu/libudev.so
-- include: /usr/include
-- hidapi_parser
-- Using fftw3f
-- Found Sndfile: /usr/lib/x86_64-linux-gnu/libsndfile.so  
-- Looking for XOpenDisplay in /usr/lib/x86_64-linux-gnu/libX11.so;/usr/lib/x86_64-linux-gnu/libXext.so
-- Looking for XOpenDisplay in /usr/lib/x86_64-linux-gnu/libX11.so;/usr/lib/x86_64-linux-gnu/libXext.so - found
-- Looking for gethostbyname
-- Looking for gethostbyname - found
-- Looking for connect
-- Looking for connect - found
-- Looking for remove
-- Looking for remove - found
-- Looking for shmat
-- Looking for shmat - found
-- Looking for IceConnectionNumber in ICE
-- Looking for IceConnectionNumber in ICE - found
-- Found X11: /usr/lib/x86_64-linux-gnu/libX11.so
-- Found PkgConfig: /usr/bin/pkg-config (found version "0.29.1") 
-- Checking for module 'jack'
-- Found jack, version 1.9.11
-- Found jack: /usr/lib/x86_64-linux-gnu/libjack.so
-- Audio API: jack
-- Could NOT find Avahi (missing: AVAHI_LIBRARY-COMMON AVAHI_LIBRARY-CLIENT AVAHI_INCLUDE_DIR) 
-- Found ALSA: /usr/lib/x86_64-linux-gnu/libasound.so (found version "1.1.0") 
-- Found GNU Readline version 6.3: /usr/lib/x86_64-linux-gnu/libreadline.so
CMake Warning (dev) at /home/ss/Qt/5.3/gcc_64/lib/cmake/Qt5Core/Qt5CoreMacros.cmake:224 (configure_file):
  configure_file called with unknown argument(s):

   COPY_ONLY

Call Stack (most recent call first):
  QtCollider/CMakeLists.txt:137 (qt5_add_resources)
  lang/CMakeLists.txt:182 (include)
This warning is for project developers. Use -Wno-dev to suppress it.

-- Found Qt: /home/ss/Qt/5.3/gcc_64/lib/libQt5Core.so.5.3.2
-- Compiling with Readline support
-- Compiling with ALSA midi support
-- Building the Qt IDE
CMake Warning (dev) at /home/ss/Qt/5.3/gcc_64/lib/cmake/Qt5Core/Qt5CoreMacros.cmake:224 (configure_file):
  configure_file called with unknown argument(s):

   COPY_ONLY

Call Stack (most recent call first):
  editors/sc-ide/CMakeLists.txt:237 (qt5_add_resources)
This warning is for project developers. Use -Wno-dev to suppress it.

CMake Error at editors/scel/el/CMakeLists.txt:21 (message):
  Emacs could not be found.

   (If emacs interface is not required, then set SC_EL=no)


-- Building with Sced for gedit 3 (UNIX)
-- Configuring incomplete, errors occurred!
See also "/home/ss/build/CMakeFiles/CMakeOutput.log".
ss@ss:~/build$ cmake -DCMAKE_PREFIX_PATH=/home/ss/Qt/5.3/gcc_64/ -SC_EL=no
-- SuperCollider Version: 3.8.0
-- Building from branch not_a_git_checkout, commit hash is na
-- Build type defaulting to "RelWithDebInfo"
CMake Warning at CMakeLists.txt:29 (message):
  WARNING: IN-PLACE BUILDS ARE NOT RECOMMENDED - PLEASE USE A BUILD DIRECTORY


-- Compiling with Qt GUI
-- building boost libraries manually
-- using bundled libyaml-cpp
-- HIDAPI components:
-- linux hidraw
-- libudev stable: 1
-- Found UDev: /usr/lib/x86_64-linux-gnu/libudev.so
-- include: /usr/include
-- hidapi_parser
-- Using fftw3f
-- Found jack: /usr/lib/x86_64-linux-gnu/libjack.so
-- Audio API: jack
-- Could NOT find Avahi (missing: AVAHI_LIBRARY-COMMON AVAHI_LIBRARY-CLIENT AVAHI_INCLUDE_DIR) 
-- Found GNU Readline version 6.3: /usr/lib/x86_64-linux-gnu/libreadline.so
CMake Warning (dev) at /home/ss/Qt/5.3/gcc_64/lib/cmake/Qt5Core/Qt5CoreMacros.cmake:224 (configure_file):
  configure_file called with unknown argument(s):

   COPY_ONLY

Call Stack (most recent call first):
  QtCollider/CMakeLists.txt:137 (qt5_add_resources)
  lang/CMakeLists.txt:182 (include)
This warning is for project developers. Use -Wno-dev to suppress it.

-- Found Qt: /home/ss/Qt/5.3/gcc_64/lib/libQt5Core.so.5.3.2
-- Compiling with Readline support
-- Compiling with ALSA midi support
-- Building the Qt IDE
CMake Warning (dev) at /home/ss/Qt/5.3/gcc_64/lib/cmake/Qt5Core/Qt5CoreMacros.cmake:224 (configure_file):
  configure_file called with unknown argument(s):

   COPY_ONLY

Call Stack (most recent call first):
  editors/sc-ide/CMakeLists.txt:237 (qt5_add_resources)
This warning is for project developers. Use -Wno-dev to suppress it.

CMake Error at editors/scel/el/CMakeLists.txt:21 (message):
  Emacs could not be found.

   (If emacs interface is not required, then set SC_EL=no)


CMake Error at editors/scel/el/CMakeLists.txt:34 (add_custom_target):
  add_custom_target cannot create target "sclang-vars.elc" because another
  target with the same name already exists. The existing target is a custom
  target created in source directory "/home/ss/build/editors/scel/el". See
  documentation for policy CMP0002 for more details.


-- Building with Sced for gedit 3 (UNIX)
-- Configuring incomplete, errors occurred!
See also "/home/ss/build/CMakeFiles/CMakeOutput.log".
ss@ss:~/build$ cmake -DSC_EL=NO ..
CMake Error: The source directory "/home/ss" does not appear to contain CMakeLists.txt.
Specify --help for usage, or press the help button on the CMake GUI.
ss@ss:~/build$ cd /home/ss/build/
ss@ss:~/build$ dir
AUTHORS CMakeFiles CPackConfig.cmake HelpSource platform SCVersion.txt
build_sclang.cfg CMakeLists.txt CPackSourceConfig.cmake icons QtCollider server
build_sclang.cfg.in cmake_modules DartConfiguration.tcl include README_LINUX.md sounds
ChangeLog cmake_uninstall.cmake editors INSTALL README.md Testing
CHANGELOG.md common examples lang SCClassLibrary testsuite
CMakeCache.txt COPYING external_libraries package SCDoc travis_test_run_proto.json
ss@ss:~/build$ cmake -DSC_EL=NO ..
CMake Error: The source directory "/home/ss" does not appear to contain CMakeLists.txt.
Specify --help for usage, or press the help button on the CMake GUI.
ss@ss:~/build$ cmake -DSC_EL=NO
-- SuperCollider Version: 3.8.0
-- Building from branch not_a_git_checkout, commit hash is na
-- Build type defaulting to "RelWithDebInfo"
CMake Warning at CMakeLists.txt:29 (message):
  WARNING: IN-PLACE BUILDS ARE NOT RECOMMENDED - PLEASE USE A BUILD DIRECTORY


-- Compiling with Qt GUI
-- building boost libraries manually
-- using bundled libyaml-cpp
-- HIDAPI components:
-- linux hidraw
-- libudev stable: 1
-- Found UDev: /usr/lib/x86_64-linux-gnu/libudev.so
-- include: /usr/include
-- hidapi_parser
-- Using fftw3f
-- Found jack: /usr/lib/x86_64-linux-gnu/libjack.so
-- Audio API: jack
-- Could NOT find Avahi (missing: AVAHI_LIBRARY-COMMON AVAHI_LIBRARY-CLIENT AVAHI_INCLUDE_DIR) 
-- Found GNU Readline version 6.3: /usr/lib/x86_64-linux-gnu/libreadline.so
CMake Warning (dev) at /home/ss/Qt/5.3/gcc_64/lib/cmake/Qt5Core/Qt5CoreMacros.cmake:224 (configure_file):
  configure_file called with unknown argument(s):

   COPY_ONLY

Call Stack (most recent call first):
  QtCollider/CMakeLists.txt:137 (qt5_add_resources)
  lang/CMakeLists.txt:182 (include)
This warning is for project developers. Use -Wno-dev to suppress it.

-- Found Qt: /home/ss/Qt/5.3/gcc_64/lib/libQt5Core.so.5.3.2
-- Compiling with Readline support
-- Compiling with ALSA midi support
-- Building the Qt IDE
CMake Warning (dev) at /home/ss/Qt/5.3/gcc_64/lib/cmake/Qt5Core/Qt5CoreMacros.cmake:224 (configure_file):
  configure_file called with unknown argument(s):

   COPY_ONLY

Call Stack (most recent call first):
  editors/sc-ide/CMakeLists.txt:237 (qt5_add_resources)
This warning is for project developers. Use -Wno-dev to suppress it.

-- Building with Sced for gedit 3 (UNIX)
-- Configuring done
-- Generating done
-- Build files have been written to: /home/ss/build
ss@ss:~/build$ cmake -DCMAKE_PREFIX_PATH=/home/ss/Qt/5.3/gcc_64/
-- SuperCollider Version: 3.8.0
-- Building from branch not_a_git_checkout, commit hash is na
-- Build type defaulting to "RelWithDebInfo"
CMake Warning at CMakeLists.txt:29 (message):
  WARNING: IN-PLACE BUILDS ARE NOT RECOMMENDED - PLEASE USE A BUILD DIRECTORY


-- Compiling with Qt GUI
-- building boost libraries manually
-- using bundled libyaml-cpp
-- HIDAPI components:
-- linux hidraw
-- libudev stable: 1
-- Found UDev: /usr/lib/x86_64-linux-gnu/libudev.so
-- include: /usr/include
-- hidapi_parser
-- Using fftw3f
-- Found jack: /usr/lib/x86_64-linux-gnu/libjack.so
-- Audio API: jack
-- Could NOT find Avahi (missing: AVAHI_LIBRARY-COMMON AVAHI_LIBRARY-CLIENT AVAHI_INCLUDE_DIR) 
-- Found GNU Readline version 6.3: /usr/lib/x86_64-linux-gnu/libreadline.so
CMake Warning (dev) at /home/ss/Qt/5.3/gcc_64/lib/cmake/Qt5Core/Qt5CoreMacros.cmake:224 (configure_file):
  configure_file called with unknown argument(s):

   COPY_ONLY

Call Stack (most recent call first):
  QtCollider/CMakeLists.txt:137 (qt5_add_resources)
  lang/CMakeLists.txt:182 (include)
This warning is for project developers. Use -Wno-dev to suppress it.

-- Found Qt: /home/ss/Qt/5.3/gcc_64/lib/libQt5Core.so.5.3.2
-- Compiling with Readline support
-- Compiling with ALSA midi support
-- Building the Qt IDE
CMake Warning (dev) at /home/ss/Qt/5.3/gcc_64/lib/cmake/Qt5Core/Qt5CoreMacros.cmake:224 (configure_file):
  configure_file called with unknown argument(s):

   COPY_ONLY

Call Stack (most recent call first):
  editors/sc-ide/CMakeLists.txt:237 (qt5_add_resources)
This warning is for project developers. Use -Wno-dev to suppress it.

-- Building with Sced for gedit 3 (UNIX)
-- Configuring done
-- Generating done
-- Build files have been written to: /home/ss/build
ss@ss:~/build$ make install
Scanning dependencies of target tlsf
[ 0%] Building C object external_libraries/CMakeFiles/tlsf.dir/TLSF-2.4.6/src/tlsf.c.o
[ 0%] Linking C static library libtlsf.a
[ 0%] Built target tlsf
Scanning dependencies of target yaml
[ 0%] Building CXX object external_libraries/CMakeFiles/yaml.dir/libyamlcpp.cpp.o
[ 1%] Linking CXX static library libyaml.a
[ 1%] Built target yaml
Scanning dependencies of target hidapi
[ 1%] Building C object external_libraries/hidapi/linux/CMakeFiles/hidapi.dir/hid.c.o
[ 1%] Linking C static library libhidapi.a
[ 1%] Built target hidapi
Scanning dependencies of target hidapi_parser
[ 1%] Building C object external_libraries/hidapi/hidapi_parser/CMakeFiles/hidapi_parser.dir/hidapi_parser.c.o
[ 1%] Linking C static library libhidapi_parser.a
[ 1%] Built target hidapi_parser
Scanning dependencies of target DiskIO_UGens_supernova
[ 2%] Building CXX object server/plugins/CMakeFiles/DiskIO_UGens_supernova.dir/DiskIO_UGens.cpp.o
[ 2%] Linking CXX shared module DiskIO_UGens_supernova.so
[ 2%] Built target DiskIO_UGens_supernova
Scanning dependencies of target UIUGens_supernova
[ 2%] Building CXX object server/plugins/CMakeFiles/UIUGens_supernova.dir/UIUGens.cpp.o
[ 2%] Linking CXX shared module UIUGens_supernova.so
[ 2%] Built target UIUGens_supernova
Scanning dependencies of target PV_ThirdParty_supernova
[ 2%] Building CXX object server/plugins/CMakeFiles/PV_ThirdParty_supernova.dir/Convolution.cpp.o
[ 2%] Building CXX object server/plugins/CMakeFiles/PV_ThirdParty_supernova.dir/FFT2InterfaceTable.cpp.o
[ 3%] Building CXX object server/plugins/CMakeFiles/PV_ThirdParty_supernova.dir/FeatureDetection.cpp.o
[ 3%] Building CXX object server/plugins/CMakeFiles/PV_ThirdParty_supernova.dir/PV_ThirdParty.cpp.o
[ 3%] Linking CXX shared module PV_ThirdParty_supernova.so
[ 3%] Built target PV_ThirdParty_supernova
Scanning dependencies of target TriggerUGens
[ 3%] Building CXX object server/plugins/CMakeFiles/TriggerUGens.dir/TriggerUGens.cpp.o
[ 3%] Linking CXX shared module TriggerUGens.so
[ 3%] Built target TriggerUGens
Scanning dependencies of target PV_ThirdParty
[ 3%] Building CXX object server/plugins/CMakeFiles/PV_ThirdParty.dir/Convolution.cpp.o
[ 4%] Building CXX object server/plugins/CMakeFiles/PV_ThirdParty.dir/FFT2InterfaceTable.cpp.o
[ 4%] Building CXX object server/plugins/CMakeFiles/PV_ThirdParty.dir/FeatureDetection.cpp.o
[ 4%] Building CXX object server/plugins/CMakeFiles/PV_ThirdParty.dir/PV_ThirdParty.cpp.o
[ 4%] Linking CXX shared module PV_ThirdParty.so
[ 4%] Built target PV_ThirdParty
Scanning dependencies of target LFUGens
[ 4%] Building CXX object server/plugins/CMakeFiles/LFUGens.dir/LFUGens.cpp.o
[ 4%] Linking CXX shared module LFUGens.so
[ 4%] Built target LFUGens
Scanning dependencies of target ReverbUGens
[ 4%] Building CXX object server/plugins/CMakeFiles/ReverbUGens.dir/ReverbUGens.cpp.o
[ 5%] Linking CXX shared module ReverbUGens.so
[ 5%] Built target ReverbUGens
Scanning dependencies of target FFT_UGens
[ 6%] Building CXX object server/plugins/CMakeFiles/FFT_UGens.dir/FFTInterfaceTable.cpp.o
[ 6%] Building CXX object server/plugins/CMakeFiles/FFT_UGens.dir/FFT_UGens.cpp.o
[ 6%] Building CXX object server/plugins/CMakeFiles/FFT_UGens.dir/PV_UGens.cpp.o
[ 6%] Building CXX object server/plugins/CMakeFiles/FFT_UGens.dir/PartitionedConvolution.cpp.o
[ 6%] Linking CXX shared module FFT_UGens.so
[ 6%] Built target FFT_UGens
Scanning dependencies of target MulAddUGens
[ 7%] Building CXX object server/plugins/CMakeFiles/MulAddUGens.dir/MulAddUGens.cpp.o
[ 7%] Linking CXX shared module MulAddUGens.so
[ 7%] Built target MulAddUGens
Scanning dependencies of target UnpackFFTUGens
[ 7%] Building CXX object server/plugins/CMakeFiles/UnpackFFTUGens.dir/UnpackFFTUGens.cpp.o
[ 7%] Linking CXX shared module UnpackFFTUGens.so
[ 7%] Built target UnpackFFTUGens
Scanning dependencies of target TestUGens_supernova
[ 7%] Building CXX object server/plugins/CMakeFiles/TestUGens_supernova.dir/TestUGens.cpp.o
[ 8%] Linking CXX shared module TestUGens_supernova.so
[ 8%] Built target TestUGens_supernova
Scanning dependencies of target PanUGens
[ 8%] Building CXX object server/plugins/CMakeFiles/PanUGens.dir/PanUGens.cpp.o
[ 8%] Linking CXX shared module PanUGens.so
[ 8%] Built target PanUGens
Scanning dependencies of target ChaosUGens_supernova
[ 9%] Building CXX object server/plugins/CMakeFiles/ChaosUGens_supernova.dir/ChaosUGens.cpp.o
[ 9%] Linking CXX shared module ChaosUGens_supernova.so
[ 9%] Built target ChaosUGens_supernova
Scanning dependencies of target ML_UGens_supernova
[ 9%] Building CXX object server/plugins/CMakeFiles/ML_UGens_supernova.dir/ML.cpp.o
[ 9%] Building CXX object server/plugins/CMakeFiles/ML_UGens_supernova.dir/Loudness.cpp.o
[ 9%] Building CXX object server/plugins/CMakeFiles/ML_UGens_supernova.dir/BeatTrack.cpp.o
[ 9%] Building CXX object server/plugins/CMakeFiles/ML_UGens_supernova.dir/Onsets.cpp.o
[ 10%] Building C object server/plugins/CMakeFiles/ML_UGens_supernova.dir/onsetsds.c.o
[ 10%] Building CXX object server/plugins/CMakeFiles/ML_UGens_supernova.dir/KeyTrack.cpp.o
[ 10%] Building CXX object server/plugins/CMakeFiles/ML_UGens_supernova.dir/MFCC.cpp.o
[ 10%] Building CXX object server/plugins/CMakeFiles/ML_UGens_supernova.dir/BeatTrack2.cpp.o
[ 10%] Building CXX object server/plugins/CMakeFiles/ML_UGens_supernova.dir/ML_SpecStats.cpp.o
[ 10%] Linking CXX shared module ML_UGens_supernova.so
[ 10%] Built target ML_UGens_supernova
Scanning dependencies of target IOUGens
[ 10%] Building CXX object server/plugins/CMakeFiles/IOUGens.dir/IOUGens.cpp.o
[ 10%] Linking CXX shared module IOUGens.so
[ 10%] Built target IOUGens
Scanning dependencies of target PhysicalModelingUGens_supernova
[ 10%] Building CXX object server/plugins/CMakeFiles/PhysicalModelingUGens_supernova.dir/PhysicalModelingUGens.cpp.o
[ 10%] Linking CXX shared module PhysicalModelingUGens_supernova.so
[ 10%] Built target PhysicalModelingUGens_supernova
Scanning dependencies of target DemandUGens
[ 11%] Building CXX object server/plugins/CMakeFiles/DemandUGens.dir/DemandUGens.cpp.o
[ 11%] Linking CXX shared module DemandUGens.so
[ 11%] Built target DemandUGens
Scanning dependencies of target MulAddUGens_supernova
[ 11%] Building CXX object server/plugins/CMakeFiles/MulAddUGens_supernova.dir/MulAddUGens.cpp.o
[ 11%] Linking CXX shared module MulAddUGens_supernova.so
[ 11%] Built target MulAddUGens_supernova
Scanning dependencies of target UIUGens
[ 11%] Building CXX object server/plugins/CMakeFiles/UIUGens.dir/UIUGens.cpp.o
[ 12%] Linking CXX shared module UIUGens.so
[ 12%] Built target UIUGens
Scanning dependencies of target UnaryOpUGens
[ 12%] Building CXX object server/plugins/CMakeFiles/UnaryOpUGens.dir/UnaryOpUGens.cpp.o
[ 12%] Linking CXX shared module UnaryOpUGens.so
[ 12%] Built target UnaryOpUGens
Scanning dependencies of target ChaosUGens
[ 12%] Building CXX object server/plugins/CMakeFiles/ChaosUGens.dir/ChaosUGens.cpp.o
[ 12%] Linking CXX shared module ChaosUGens.so
[ 12%] Built target ChaosUGens
Scanning dependencies of target BinaryOpUGens
[ 12%] Building CXX object server/plugins/CMakeFiles/BinaryOpUGens.dir/BinaryOpUGens.cpp.o
[ 12%] Linking CXX shared module BinaryOpUGens.so
[ 12%] Built target BinaryOpUGens
Scanning dependencies of target FFT_UGens_supernova
[ 12%] Building CXX object server/plugins/CMakeFiles/FFT_UGens_supernova.dir/FFTInterfaceTable.cpp.o
[ 12%] Building CXX object server/plugins/CMakeFiles/FFT_UGens_supernova.dir/FFT_UGens.cpp.o
[ 13%] Building CXX object server/plugins/CMakeFiles/FFT_UGens_supernova.dir/PV_UGens.cpp.o
[ 13%] Building CXX object server/plugins/CMakeFiles/FFT_UGens_supernova.dir/PartitionedConvolution.cpp.o
[ 13%] Linking CXX shared module FFT_UGens_supernova.so
[ 13%] Built target FFT_UGens_supernova
Scanning dependencies of target FilterUGens
[ 13%] Building CXX object server/plugins/CMakeFiles/FilterUGens.dir/FilterUGens.cpp.o
[ 13%] Linking CXX shared module FilterUGens.so
[ 13%] Built target FilterUGens
Scanning dependencies of target OscUGens
[ 13%] Building CXX object server/plugins/CMakeFiles/OscUGens.dir/OscUGens.cpp.o
[ 13%] Linking CXX shared module OscUGens.so
[ 13%] Built target OscUGens
Scanning dependencies of target DemandUGens_supernova
[ 13%] Building CXX object server/plugins/CMakeFiles/DemandUGens_supernova.dir/DemandUGens.cpp.o
[ 13%] Linking CXX shared module DemandUGens_supernova.so
[ 13%] Built target DemandUGens_supernova
Scanning dependencies of target LFUGens_supernova
[ 13%] Building CXX object server/plugins/CMakeFiles/LFUGens_supernova.dir/LFUGens.cpp.o
[ 13%] Linking CXX shared module LFUGens_supernova.so
[ 13%] Built target LFUGens_supernova
Scanning dependencies of target GrainUGens_supernova
[ 13%] Building CXX object server/plugins/CMakeFiles/GrainUGens_supernova.dir/GrainUGens.cpp.o
[ 13%] Linking CXX shared module GrainUGens_supernova.so
[ 13%] Built target GrainUGens_supernova
Scanning dependencies of target PhysicalModelingUGens
[ 13%] Building CXX object server/plugins/CMakeFiles/PhysicalModelingUGens.dir/PhysicalModelingUGens.cpp.o
[ 13%] Linking CXX shared module PhysicalModelingUGens.so
[ 13%] Built target PhysicalModelingUGens
Scanning dependencies of target GendynUGens
[ 13%] Building CXX object server/plugins/CMakeFiles/GendynUGens.dir/GendynUGens.cpp.o
[ 13%] Linking CXX shared module GendynUGens.so
[ 13%] Built target GendynUGens
Scanning dependencies of target TestUGens
[ 13%] Building CXX object server/plugins/CMakeFiles/TestUGens.dir/TestUGens.cpp.o
[ 13%] Linking CXX shared module TestUGens.so
[ 13%] Built target TestUGens
Scanning dependencies of target DelayUGens_supernova
[ 13%] Building CXX object server/plugins/CMakeFiles/DelayUGens_supernova.dir/DelayUGens.cpp.o
[ 13%] Linking CXX shared module DelayUGens_supernova.so
[ 13%] Built target DelayUGens_supernova
Scanning dependencies of target GrainUGens
[ 13%] Building CXX object server/plugins/CMakeFiles/GrainUGens.dir/GrainUGens.cpp.o
[ 14%] Linking CXX shared module GrainUGens.so
[ 14%] Built target GrainUGens
Scanning dependencies of target GendynUGens_supernova
[ 14%] Building CXX object server/plugins/CMakeFiles/GendynUGens_supernova.dir/GendynUGens.cpp.o
[ 14%] Linking CXX shared module GendynUGens_supernova.so
[ 14%] Built target GendynUGens_supernova
Scanning dependencies of target TriggerUGens_supernova
[ 14%] Building CXX object server/plugins/CMakeFiles/TriggerUGens_supernova.dir/TriggerUGens.cpp.o
[ 14%] Linking CXX shared module TriggerUGens_supernova.so
[ 14%] Built target TriggerUGens_supernova
Scanning dependencies of target ML_UGens
[ 14%] Building CXX object server/plugins/CMakeFiles/ML_UGens.dir/ML.cpp.o
[ 14%] Building CXX object server/plugins/CMakeFiles/ML_UGens.dir/Loudness.cpp.o
[ 15%] Building CXX object server/plugins/CMakeFiles/ML_UGens.dir/BeatTrack.cpp.o
[ 15%] Building CXX object server/plugins/CMakeFiles/ML_UGens.dir/Onsets.cpp.o
[ 15%] Building C object server/plugins/CMakeFiles/ML_UGens.dir/onsetsds.c.o
[ 15%] Building CXX object server/plugins/CMakeFiles/ML_UGens.dir/KeyTrack.cpp.o
[ 15%] Building CXX object server/plugins/CMakeFiles/ML_UGens.dir/MFCC.cpp.o
[ 15%] Building CXX object server/plugins/CMakeFiles/ML_UGens.dir/BeatTrack2.cpp.o
[ 16%] Building CXX object server/plugins/CMakeFiles/ML_UGens.dir/ML_SpecStats.cpp.o
[ 16%] Linking CXX shared module ML_UGens.so
[ 16%] Built target ML_UGens
Scanning dependencies of target DelayUGens
[ 16%] Building CXX object server/plugins/CMakeFiles/DelayUGens.dir/DelayUGens.cpp.o
[ 16%] Linking CXX shared module DelayUGens.so
[ 16%] Built target DelayUGens
Scanning dependencies of target IOUGens_supernova
[ 16%] Building CXX object server/plugins/CMakeFiles/IOUGens_supernova.dir/IOUGens.cpp.o
[ 17%] Linking CXX shared module IOUGens_supernova.so
[ 17%] Built target IOUGens_supernova
Scanning dependencies of target DiskIO_UGens
[ 17%] Building CXX object server/plugins/CMakeFiles/DiskIO_UGens.dir/DiskIO_UGens.cpp.o
[ 17%] Linking CXX shared module DiskIO_UGens.so
[ 17%] Built target DiskIO_UGens
Scanning dependencies of target DynNoiseUGens
[ 17%] Building CXX object server/plugins/CMakeFiles/DynNoiseUGens.dir/DynNoiseUGens.cpp.o
[ 17%] Linking CXX shared module DynNoiseUGens.so
[ 17%] Built target DynNoiseUGens
Scanning dependencies of target BinaryOpUGens_supernova
[ 17%] Building CXX object server/plugins/CMakeFiles/BinaryOpUGens_supernova.dir/BinaryOpUGens.cpp.o
[ 17%] Linking CXX shared module BinaryOpUGens_supernova.so
[ 17%] Built target BinaryOpUGens_supernova
Scanning dependencies of target NoiseUGens_supernova
[ 18%] Building CXX object server/plugins/CMakeFiles/NoiseUGens_supernova.dir/NoiseUGens.cpp.o
[ 18%] Linking CXX shared module NoiseUGens_supernova.so
[ 18%] Built target NoiseUGens_supernova
Scanning dependencies of target NoiseUGens
[ 18%] Building CXX object server/plugins/CMakeFiles/NoiseUGens.dir/NoiseUGens.cpp.o
[ 18%] Linking CXX shared module NoiseUGens.so
[ 18%] Built target NoiseUGens
Scanning dependencies of target OscUGens_supernova
[ 18%] Building CXX object server/plugins/CMakeFiles/OscUGens_supernova.dir/OscUGens.cpp.o
[ 18%] Linking CXX shared module OscUGens_supernova.so
[ 18%] Built target OscUGens_supernova
Scanning dependencies of target FilterUGens_supernova
[ 18%] Building CXX object server/plugins/CMakeFiles/FilterUGens_supernova.dir/FilterUGens.cpp.o
[ 19%] Linking CXX shared module FilterUGens_supernova.so
[ 19%] Built target FilterUGens_supernova
Scanning dependencies of target DynNoiseUGens_supernova
[ 19%] Building CXX object server/plugins/CMakeFiles/DynNoiseUGens_supernova.dir/DynNoiseUGens.cpp.o
[ 19%] Linking CXX shared module DynNoiseUGens_supernova.so
[ 19%] Built target DynNoiseUGens_supernova
Scanning dependencies of target PanUGens_supernova
[ 19%] Building CXX object server/plugins/CMakeFiles/PanUGens_supernova.dir/PanUGens.cpp.o
[ 20%] Linking CXX shared module PanUGens_supernova.so
[ 20%] Built target PanUGens_supernova
Scanning dependencies of target ReverbUGens_supernova
[ 20%] Building CXX object server/plugins/CMakeFiles/ReverbUGens_supernova.dir/ReverbUGens.cpp.o
[ 20%] Linking CXX shared module ReverbUGens_supernova.so
[ 20%] Built target ReverbUGens_supernova
Scanning dependencies of target UnaryOpUGens_supernova
[ 20%] Building CXX object server/plugins/CMakeFiles/UnaryOpUGens_supernova.dir/UnaryOpUGens.cpp.o
[ 21%] Linking CXX shared module UnaryOpUGens_supernova.so
[ 21%] Built target UnaryOpUGens_supernova
Scanning dependencies of target UnpackFFTUGens_supernova
[ 21%] Building CXX object server/plugins/CMakeFiles/UnpackFFTUGens_supernova.dir/UnpackFFTUGens.cpp.o
[ 21%] Linking CXX shared module UnpackFFTUGens_supernova.so
[ 21%] Built target UnpackFFTUGens_supernova
Scanning dependencies of target boost_system
[ 21%] Building CXX object external_libraries/CMakeFiles/boost_system.dir/boost/libs/system/src/error_code.cpp.o
[ 21%] Linking CXX static library libboost_system.a
[ 21%] Built target boost_system
Scanning dependencies of target libscsynth
[ 21%] Building CXX object server/scsynth/CMakeFiles/libscsynth.dir/SC_BufGen.cpp.o
[ 21%] Building CXX object server/scsynth/CMakeFiles/libscsynth.dir/SC_ComPort.cpp.o
[ 21%] Building CXX object server/scsynth/CMakeFiles/libscsynth.dir/SC_CoreAudio.cpp.o
[ 21%] Building CXX object server/scsynth/CMakeFiles/libscsynth.dir/SC_Graph.cpp.o
[ 22%] Building CXX object server/scsynth/CMakeFiles/libscsynth.dir/SC_GraphDef.cpp.o
[ 22%] Building CXX object server/scsynth/CMakeFiles/libscsynth.dir/SC_Group.cpp.o
[ 22%] Building CXX object server/scsynth/CMakeFiles/libscsynth.dir/SC_Lib_Cintf.cpp.o
[ 22%] Building CXX object server/scsynth/CMakeFiles/libscsynth.dir/SC_Lib.cpp.o
[ 22%] Building CXX object server/scsynth/CMakeFiles/libscsynth.dir/SC_MiscCmds.cpp.o
[ 22%] Building CXX object server/scsynth/CMakeFiles/libscsynth.dir/SC_Node.cpp.o
[ 23%] Building CXX object server/scsynth/CMakeFiles/libscsynth.dir/SC_Rate.cpp.o
[ 23%] Building CXX object server/scsynth/CMakeFiles/libscsynth.dir/SC_SequencedCommand.cpp.o
[ 23%] Building CXX object server/scsynth/CMakeFiles/libscsynth.dir/SC_Str4.cpp.o
[ 23%] Building CXX object server/scsynth/CMakeFiles/libscsynth.dir/SC_Unit.cpp.o
[ 23%] Building CXX object server/scsynth/CMakeFiles/libscsynth.dir/SC_UnitDef.cpp.o
[ 23%] Building CXX object server/scsynth/CMakeFiles/libscsynth.dir/SC_World.cpp.o
[ 24%] Building CXX object server/scsynth/CMakeFiles/libscsynth.dir/Rendezvous.cpp.o
[ 24%] Building CXX object server/scsynth/CMakeFiles/libscsynth.dir/__/__/common/SC_fftlib.cpp.o
[ 24%] Building CXX object server/scsynth/CMakeFiles/libscsynth.dir/__/__/common/SC_AllocPool.cpp.o
[ 24%] Building CXX object server/scsynth/CMakeFiles/libscsynth.dir/__/__/common/SC_DirUtils.cpp.o
[ 24%] Building CXX object server/scsynth/CMakeFiles/libscsynth.dir/__/__/common/SC_Errors.cpp.o
[ 24%] Building CXX object server/scsynth/CMakeFiles/libscsynth.dir/__/__/common/SC_Reply.cpp.o
[ 25%] Building CXX object server/scsynth/CMakeFiles/libscsynth.dir/__/__/common/SC_StandAloneInfo_Darwin.cpp.o
[ 25%] Building CXX object server/scsynth/CMakeFiles/libscsynth.dir/__/__/common/SC_StringBuffer.cpp.o
[ 25%] Building CXX object server/scsynth/CMakeFiles/libscsynth.dir/__/__/common/SC_StringParser.cpp.o
[ 25%] Building CXX object server/scsynth/CMakeFiles/libscsynth.dir/__/__/common/Samp.cpp.o
[ 25%] Building CXX object server/scsynth/CMakeFiles/libscsynth.dir/__/__/common/sc_popen.cpp.o
[ 25%] Building CXX object server/scsynth/CMakeFiles/libscsynth.dir/__/__/external_libraries/boost/libs/system/src/error_code.cpp.o
[ 26%] Building CXX object server/scsynth/CMakeFiles/libscsynth.dir/SC_Jack.cpp.o
[ 26%] Linking CXX static library libscsynth.a
[ 26%] Built target libscsynth
Scanning dependencies of target scsynth
[ 26%] Building CXX object server/scsynth/CMakeFiles/scsynth.dir/scsynth_main.cpp.o
[ 26%] Linking CXX executable scsynth
[ 26%] Built target scsynth
Scanning dependencies of target boost_thread
[ 26%] Building CXX object external_libraries/CMakeFiles/boost_thread.dir/boost/libs/thread/src/future.cpp.o
[ 27%] Building CXX object external_libraries/CMakeFiles/boost_thread.dir/boost/libs/thread/src/tss_null.cpp.o
[ 27%] Building CXX object external_libraries/CMakeFiles/boost_thread.dir/boost/libs/thread/src/pthread/once_atomic.cpp.o
[ 27%] Building CXX object external_libraries/CMakeFiles/boost_thread.dir/boost/libs/thread/src/pthread/once.cpp.o
[ 27%] Building CXX object external_libraries/CMakeFiles/boost_thread.dir/boost/libs/thread/src/pthread/thread.cpp.o
[ 27%] Linking CXX static library libboost_thread.a
[ 27%] Built target boost_thread
Scanning dependencies of target boost_filesystem
[ 27%] Building CXX object external_libraries/CMakeFiles/boost_filesystem.dir/boost/libs/filesystem/src/unique_path.cpp.o
[ 28%] Building CXX object external_libraries/CMakeFiles/boost_filesystem.dir/boost/libs/filesystem/src/operations.cpp.o
[ 28%] Building CXX object external_libraries/CMakeFiles/boost_filesystem.dir/boost/libs/filesystem/src/windows_file_codecvt.cpp.o
[ 28%] Building CXX object external_libraries/CMakeFiles/boost_filesystem.dir/boost/libs/filesystem/src/utf8_codecvt_facet.cpp.o
[ 28%] Building CXX object external_libraries/CMakeFiles/boost_filesystem.dir/boost/libs/filesystem/src/portability.cpp.o
[ 28%] Building CXX object external_libraries/CMakeFiles/boost_filesystem.dir/boost/libs/filesystem/src/path.cpp.o
[ 28%] Building CXX object external_libraries/CMakeFiles/boost_filesystem.dir/boost/libs/filesystem/src/path_traits.cpp.o
[ 28%] Building CXX object external_libraries/CMakeFiles/boost_filesystem.dir/boost/libs/filesystem/src/codecvt_error_category.cpp.o
[ 29%] Linking CXX static library libboost_filesystem.a
[ 29%] Built target boost_filesystem
Scanning dependencies of target oscpack
[ 29%] Building CXX object external_libraries/CMakeFiles/oscpack.dir/oscpack_build.cpp.o
[ 29%] Linking CXX static library liboscpack.a
[ 29%] Built target oscpack
Scanning dependencies of target boost_program_options
[ 29%] Building CXX object external_libraries/CMakeFiles/boost_program_options.dir/boost/libs/program_options/src/options_description.cpp.o
[ 29%] Building CXX object external_libraries/CMakeFiles/boost_program_options.dir/boost/libs/program_options/src/value_semantic.cpp.o
[ 29%] Building CXX object external_libraries/CMakeFiles/boost_program_options.dir/boost/libs/program_options/src/variables_map.cpp.o
[ 29%] Building CXX object external_libraries/CMakeFiles/boost_program_options.dir/boost/libs/program_options/src/utf8_codecvt_facet.cpp.o
[ 29%] Building CXX object external_libraries/CMakeFiles/boost_program_options.dir/boost/libs/program_options/src/positional_options.cpp.o
[ 30%] Building CXX object external_libraries/CMakeFiles/boost_program_options.dir/boost/libs/program_options/src/parsers.cpp.o
[ 30%] Building CXX object external_libraries/CMakeFiles/boost_program_options.dir/boost/libs/program_options/src/split.cpp.o
[ 30%] Building CXX object external_libraries/CMakeFiles/boost_program_options.dir/boost/libs/program_options/src/convert.cpp.o
[ 30%] Building CXX object external_libraries/CMakeFiles/boost_program_options.dir/boost/libs/program_options/src/winmain.cpp.o
[ 30%] Building CXX object external_libraries/CMakeFiles/boost_program_options.dir/boost/libs/program_options/src/config_file.cpp.o
[ 30%] Building CXX object external_libraries/CMakeFiles/boost_program_options.dir/boost/libs/program_options/src/cmdline.cpp.o
[ 31%] Linking CXX static library libboost_program_options.a
[ 31%] Built target boost_program_options
Scanning dependencies of target libsupernova
[ 31%] Building CXX object server/supernova/CMakeFiles/libsupernova.dir/sc/sc_synth_definition.cpp.o
[ 31%] Building CXX object server/supernova/CMakeFiles/libsupernova.dir/sc/sc_osc_handler.cpp.o
[ 31%] Building CXX object server/supernova/CMakeFiles/libsupernova.dir/sc/sc_plugin_interface.cpp.o
[ 31%] Building CXX object server/supernova/CMakeFiles/libsupernova.dir/sc/sc_synth.cpp.o
[ 31%] Building CXX object server/supernova/CMakeFiles/libsupernova.dir/sc/sc_synthdef.cpp.o
[ 32%] Building CXX object server/supernova/CMakeFiles/libsupernova.dir/sc/sc_ugen_factory.cpp.o
[ 32%] Building CXX object server/supernova/CMakeFiles/libsupernova.dir/__/__/common/Samp.cpp.o
[ 32%] Building CXX object server/supernova/CMakeFiles/libsupernova.dir/__/__/common/SC_fftlib.cpp.o
[ 32%] Building CXX object server/supernova/CMakeFiles/libsupernova.dir/__/__/common/SC_DirUtils.cpp.o
[ 32%] Building CXX object server/supernova/CMakeFiles/libsupernova.dir/__/__/common/SC_StringParser.cpp.o
[ 32%] Building CXX object server/supernova/CMakeFiles/libsupernova.dir/__/__/common/SC_StandAloneInfo_Darwin.cpp.o
[ 33%] Building CXX object server/supernova/CMakeFiles/libsupernova.dir/server/buffer_manager.cpp.o
[ 33%] Building CXX object server/supernova/CMakeFiles/libsupernova.dir/server/memory_pool.cpp.o
[ 33%] Building CXX object server/supernova/CMakeFiles/libsupernova.dir/server/node_graph.cpp.o
[ 33%] Building CXX object server/supernova/CMakeFiles/libsupernova.dir/server/server.cpp.o
[ 33%] Building CXX object server/supernova/CMakeFiles/libsupernova.dir/server/server_args.cpp.o
[ 33%] Linking CXX static library libsupernova.a
[ 33%] Built target libsupernova
Scanning dependencies of target supernova
[ 33%] Building CXX object server/supernova/CMakeFiles/supernova.dir/server/main.cpp.o
[ 34%] Linking CXX executable supernova
[ 34%] Built target supernova
[ 34%] Generating __/editors/sc-ide/primitives/moc_sc_ipc_client.cpp
[ 35%] Generating __/QtCollider/moc_QcApplication.cpp
[ 35%] Generating __/QtCollider/moc_QObjectProxy.cpp
[ 35%] Generating __/QtCollider/moc_QWidgetProxy.cpp
[ 35%] Generating __/QtCollider/moc_QtDownload.cpp
[ 35%] Generating __/QtCollider/widgets/moc_BasicWidgets.cpp
[ 35%] Generating __/QtCollider/widgets/moc_QcButton.cpp
[ 36%] Generating __/QtCollider/widgets/moc_QcCheckBox.cpp
[ 36%] Generating __/QtCollider/widgets/moc_QcTextField.cpp
[ 36%] Generating __/QtCollider/widgets/moc_QcListWidget.cpp
[ 36%] Generating __/QtCollider/widgets/moc_QcPopUpMenu.cpp
[ 36%] Generating __/QtCollider/widgets/moc_QcTreeWidget.cpp
[ 36%] Generating __/QtCollider/widgets/moc_QcScrollArea.cpp
[ 37%] Generating __/QtCollider/widgets/moc_QcNumberBox.cpp
[ 37%] Generating __/QtCollider/widgets/moc_QcSlider.cpp
[ 37%] Generating __/QtCollider/widgets/moc_QcSlider2D.cpp
[ 37%] Generating __/QtCollider/widgets/moc_QcRangeSlider.cpp
[ 37%] Generating __/QtCollider/widgets/moc_QcMultiSlider.cpp
[ 37%] Generating __/QtCollider/widgets/moc_QcKnob.cpp
[ 38%] Generating __/QtCollider/widgets/moc_QcTextEdit.cpp
[ 38%] Generating __/QtCollider/widgets/moc_QcScope.cpp
[ 38%] Generating __/QtCollider/widgets/moc_QcScopeShm.cpp
[ 38%] Generating __/QtCollider/widgets/moc_QcGraph.cpp
[ 38%] Generating __/QtCollider/widgets/moc_QcLevelIndicator.cpp
[ 38%] Generating __/QtCollider/widgets/moc_QcCanvas.cpp
[ 38%] Generating __/QtCollider/widgets/soundfileview/moc_view.cpp
[ 39%] Generating __/QtCollider/widgets/moc_QcFileDialog.cpp
[ 39%] Generating __/QtCollider/widgets/moc_QcPenPrinter.cpp
[ 39%] Generating __/QtCollider/widgets/moc_QcWebView.cpp
[ 39%] Generating __/QtCollider/widgets/moc_web_page.cpp
[ 39%] Generating __/QtCollider/widgets/moc_QcWindow.cpp
[ 39%] Generating __/QtCollider/layouts/moc_layouts.cpp
[ 40%] Generating __/QtCollider/layouts/moc_stack_layout.cpp
[ 40%] Generating __/QtCollider/style/moc_style.cpp
[ 40%] Generating __/QtCollider/moc_LanguageClient.cpp
[ 40%] Generating qrc_resources.cpp
Scanning dependencies of target libsclang
[ 40%] Building CXX object lang/CMakeFiles/libsclang.dir/LangPrimSource/SC_HID_api.cpp.o
[ 41%] Building CXX object lang/CMakeFiles/libsclang.dir/LangPrimSource/SC_Wii.cpp.o
[ 41%] Building CXX object lang/CMakeFiles/libsclang.dir/LangPrimSource/PyrSignalPrim.cpp.o
[ 41%] Building CXX object lang/CMakeFiles/libsclang.dir/LangPrimSource/PyrSched.cpp.o
[ 41%] Building CXX object lang/CMakeFiles/libsclang.dir/LangPrimSource/PyrPrimitive.cpp.o
[ 41%] Building CXX object lang/CMakeFiles/libsclang.dir/LangPrimSource/PyrMathPrim.cpp.o
[ 41%] Building CXX object lang/CMakeFiles/libsclang.dir/LangPrimSource/SC_ComPort.cpp.o
[ 42%] Building CXX object lang/CMakeFiles/libsclang.dir/LangPrimSource/OSCData.cpp.o
[ 42%] Building CXX object lang/CMakeFiles/libsclang.dir/LangPrimSource/PyrArchiver.cpp.o
[ 42%] Building CXX object lang/CMakeFiles/libsclang.dir/LangPrimSource/PyrArrayPrimitives.cpp.o
[ 42%] Building CXX object lang/CMakeFiles/libsclang.dir/LangPrimSource/PyrBitPrim.cpp.o
[ 42%] Building CXX object lang/CMakeFiles/libsclang.dir/LangPrimSource/PyrCharPrim.cpp.o
[ 42%] Building CXX object lang/CMakeFiles/libsclang.dir/LangPrimSource/PyrFilePrim.cpp.o
[ 42%] Building CXX object lang/CMakeFiles/libsclang.dir/LangPrimSource/PyrListPrim.cpp.o
[ 43%] Building CXX object lang/CMakeFiles/libsclang.dir/LangPrimSource/PyrPlatformPrim.cpp.o
[ 43%] Building CXX object lang/CMakeFiles/libsclang.dir/LangPrimSource/PyrStringPrim.cpp.o
In file included from /home/ss/build/external_libraries/yaml-cpp-0.3.0/include/yaml-cpp/yaml.h:8:0,
                 from /home/ss/build/lang/LangPrimSource/PyrStringPrim.cpp:47:
/home/ss/build/external_libraries/yaml-cpp-0.3.0/include/yaml-cpp/parser.h:46:8: warning: ‘template<class> class std::auto_ptr’ is deprecated [-Wdeprecated-declarations]
   std::auto_ptr<Scanner> m_pScanner;
        ^
In file included from /usr/include/c++/5/bits/locale_conv.h:41:0,
                 from /usr/include/c++/5/locale:43,
                 from /home/ss/build/external_libraries/boost/boost/algorithm/string/classification.hpp:15,
                 from /home/ss/build/external_libraries/boost/boost/algorithm/string/trim.hpp:23,
                 from /home/ss/build/external_libraries/boost/boost/algorithm/string.hpp:19,
                 from /home/ss/build/common/SC_DirUtils.h:37,
                 from /home/ss/build/lang/LangPrimSource/PyrStringPrim.cpp:34:
/usr/include/c++/5/bits/unique_ptr.h:49:28: note: declared here
   template<typename> class auto_ptr;
                            ^
In file included from /home/ss/build/external_libraries/yaml-cpp-0.3.0/include/yaml-cpp/yaml.h:8:0,
                 from /home/ss/build/lang/LangPrimSource/PyrStringPrim.cpp:47:
/home/ss/build/external_libraries/yaml-cpp-0.3.0/include/yaml-cpp/parser.h:47:8: warning: ‘template<class> class std::auto_ptr’ is deprecated [-Wdeprecated-declarations]
   std::auto_ptr<Directives> m_pDirectives;
        ^
In file included from /usr/include/c++/5/bits/locale_conv.h:41:0,
                 from /usr/include/c++/5/locale:43,
                 from /home/ss/build/external_libraries/boost/boost/algorithm/string/classification.hpp:15,
                 from /home/ss/build/external_libraries/boost/boost/algorithm/string/trim.hpp:23,
                 from /home/ss/build/external_libraries/boost/boost/algorithm/string.hpp:19,
                 from /home/ss/build/common/SC_DirUtils.h:37,
                 from /home/ss/build/lang/LangPrimSource/PyrStringPrim.cpp:34:
/usr/include/c++/5/bits/unique_ptr.h:49:28: note: declared here
   template<typename> class auto_ptr;
                            ^
In file included from /home/ss/build/external_libraries/yaml-cpp-0.3.0/include/yaml-cpp/yaml.h:9:0,
                 from /home/ss/build/lang/LangPrimSource/PyrStringPrim.cpp:47:
/home/ss/build/external_libraries/yaml-cpp-0.3.0/include/yaml-cpp/emitter.h:105:8: warning: ‘template<class> class std::auto_ptr’ is deprecated [-Wdeprecated-declarations]
   std::auto_ptr <EmitterState> m_pState;
        ^
In file included from /usr/include/c++/5/bits/locale_conv.h:41:0,
                 from /usr/include/c++/5/locale:43,
                 from /home/ss/build/external_libraries/boost/boost/algorithm/string/classification.hpp:15,
                 from /home/ss/build/external_libraries/boost/boost/algorithm/string/trim.hpp:23,
                 from /home/ss/build/external_libraries/boost/boost/algorithm/string.hpp:19,
                 from /home/ss/build/common/SC_DirUtils.h:37,
                 from /home/ss/build/lang/LangPrimSource/PyrStringPrim.cpp:34:
/usr/include/c++/5/bits/unique_ptr.h:49:28: note: declared here
   template<typename> class auto_ptr;
                            ^
In file included from /home/ss/build/external_libraries/yaml-cpp-0.3.0/include/yaml-cpp/node.h:14:0,
                 from /home/ss/build/external_libraries/yaml-cpp-0.3.0/include/yaml-cpp/yaml.h:13,
                 from /home/ss/build/lang/LangPrimSource/PyrStringPrim.cpp:47:
/home/ss/build/external_libraries/yaml-cpp-0.3.0/include/yaml-cpp/iterator.h:20:17: warning: ‘template<class> class std::auto_ptr’ is deprecated [-Wdeprecated-declarations]
   Iterator(std::auto_ptr<IterPriv> pData);
                 ^
In file included from /usr/include/c++/5/bits/locale_conv.h:41:0,
                 from /usr/include/c++/5/locale:43,
                 from /home/ss/build/external_libraries/boost/boost/algorithm/string/classification.hpp:15,
                 from /home/ss/build/external_libraries/boost/boost/algorithm/string/trim.hpp:23,
                 from /home/ss/build/external_libraries/boost/boost/algorithm/string.hpp:19,
                 from /home/ss/build/common/SC_DirUtils.h:37,
                 from /home/ss/build/lang/LangPrimSource/PyrStringPrim.cpp:34:
/usr/include/c++/5/bits/unique_ptr.h:49:28: note: declared here
   template<typename> class auto_ptr;
                            ^
In file included from /home/ss/build/external_libraries/yaml-cpp-0.3.0/include/yaml-cpp/node.h:14:0,
                 from /home/ss/build/external_libraries/yaml-cpp-0.3.0/include/yaml-cpp/yaml.h:13,
                 from /home/ss/build/lang/LangPrimSource/PyrStringPrim.cpp:47:
/home/ss/build/external_libraries/yaml-cpp-0.3.0/include/yaml-cpp/iterator.h:36:8: warning: ‘template<class> class std::auto_ptr’ is deprecated [-Wdeprecated-declarations]
   std::auto_ptr<IterPriv> m_pData;
        ^
In file included from /usr/include/c++/5/bits/locale_conv.h:41:0,
                 from /usr/include/c++/5/locale:43,
                 from /home/ss/build/external_libraries/boost/boost/algorithm/string/classification.hpp:15,
                 from /home/ss/build/external_libraries/boost/boost/algorithm/string/trim.hpp:23,
                 from /home/ss/build/external_libraries/boost/boost/algorithm/string.hpp:19,
                 from /home/ss/build/common/SC_DirUtils.h:37,
                 from /home/ss/build/lang/LangPrimSource/PyrStringPrim.cpp:34:
/usr/include/c++/5/bits/unique_ptr.h:49:28: note: declared here
   template<typename> class auto_ptr;
                            ^
In file included from /home/ss/build/external_libraries/yaml-cpp-0.3.0/include/yaml-cpp/yaml.h:13:0,
                 from /home/ss/build/lang/LangPrimSource/PyrStringPrim.cpp:47:
/home/ss/build/external_libraries/yaml-cpp-0.3.0/include/yaml-cpp/node.h:43:8: warning: ‘template<class> class std::auto_ptr’ is deprecated [-Wdeprecated-declarations]
   std::auto_ptr<Node> Clone() const;
        ^
In file included from /usr/include/c++/5/bits/locale_conv.h:41:0,
                 from /usr/include/c++/5/locale:43,
                 from /home/ss/build/external_libraries/boost/boost/algorithm/string/classification.hpp:15,
                 from /home/ss/build/external_libraries/boost/boost/algorithm/string/trim.hpp:23,
                 from /home/ss/build/external_libraries/boost/boost/algorithm/string.hpp:19,
                 from /home/ss/build/common/SC_DirUtils.h:37,
                 from /home/ss/build/lang/LangPrimSource/PyrStringPrim.cpp:34:
/usr/include/c++/5/bits/unique_ptr.h:49:28: note: declared here
   template<typename> class auto_ptr;
                            ^
In file included from /home/ss/build/external_libraries/yaml-cpp-0.3.0/include/yaml-cpp/yaml.h:13:0,
                 from /home/ss/build/lang/LangPrimSource/PyrStringPrim.cpp:47:
/home/ss/build/external_libraries/yaml-cpp-0.3.0/include/yaml-cpp/node.h:117:8: warning: ‘template<class> class std::auto_ptr’ is deprecated [-Wdeprecated-declarations]
   std::auto_ptr<NodeOwnership> m_pOwnership;
        ^
In file included from /usr/include/c++/5/bits/locale_conv.h:41:0,
                 from /usr/include/c++/5/locale:43,
                 from /home/ss/build/external_libraries/boost/boost/algorithm/string/classification.hpp:15,
                 from /home/ss/build/external_libraries/boost/boost/algorithm/string/trim.hpp:23,
                 from /home/ss/build/external_libraries/boost/boost/algorithm/string.hpp:19,
                 from /home/ss/build/common/SC_DirUtils.h:37,
                 from /home/ss/build/lang/LangPrimSource/PyrStringPrim.cpp:34:
/usr/include/c++/5/bits/unique_ptr.h:49:28: note: declared here
   template<typename> class auto_ptr;
                            ^
[ 43%] Building CXX object lang/CMakeFiles/libsclang.dir/LangPrimSource/PyrSymbolPrim.cpp.o
[ 43%] Building CXX object lang/CMakeFiles/libsclang.dir/LangPrimSource/PyrUnixPrim.cpp.o
[ 43%] Building CXX object lang/CMakeFiles/libsclang.dir/LangSource/AdvancingAllocPool.cpp.o
[ 43%] Building CXX object lang/CMakeFiles/libsclang.dir/LangSource/ByteCodeArray.cpp.o
[ 44%] Building CXX object lang/CMakeFiles/libsclang.dir/LangSource/DumpParseNode.cpp.o
[ 44%] Building CXX object lang/CMakeFiles/libsclang.dir/LangSource/GC.cpp.o
[ 44%] Building CXX object lang/CMakeFiles/libsclang.dir/LangSource/InitAlloc.cpp.o
[ 44%] Building CXX object lang/CMakeFiles/libsclang.dir/LangSource/PyrInterpreter3.cpp.o
[ 44%] Building CXX object lang/CMakeFiles/libsclang.dir/LangSource/PyrLexer.cpp.o
[ 44%] Building CXX object lang/CMakeFiles/libsclang.dir/LangSource/PyrMathOps.cpp.o
[ 45%] Building CXX object lang/CMakeFiles/libsclang.dir/LangSource/PyrMathSupport.cpp.o
[ 45%] Building CXX object lang/CMakeFiles/libsclang.dir/LangSource/PyrMessage.cpp.o
[ 45%] Building CXX object lang/CMakeFiles/libsclang.dir/LangSource/PyrObject.cpp.o
[ 45%] Building CXX object lang/CMakeFiles/libsclang.dir/LangSource/PyrParseNode.cpp.o
[ 45%] Building CXX object lang/CMakeFiles/libsclang.dir/LangSource/PyrSignal.cpp.o
[ 45%] Building CXX object lang/CMakeFiles/libsclang.dir/LangSource/PyrSymbolTable.cpp.o
[ 46%] Building CXX object lang/CMakeFiles/libsclang.dir/LangSource/SC_LanguageClient.cpp.o
[ 46%] Building CXX object lang/CMakeFiles/libsclang.dir/LangSource/SC_LanguageConfig.cpp.o
In file included from /home/ss/build/external_libraries/yaml-cpp-0.3.0/include/yaml-cpp/yaml.h:8:0,
                 from /home/ss/build/lang/LangSource/SC_LanguageConfig.cpp:45:
/home/ss/build/external_libraries/yaml-cpp-0.3.0/include/yaml-cpp/parser.h:46:8: warning: ‘template<class> class std::auto_ptr’ is deprecated [-Wdeprecated-declarations]
   std::auto_ptr<Scanner> m_pScanner;
        ^
In file included from /usr/include/c++/5/bits/locale_conv.h:41:0,
                 from /usr/include/c++/5/locale:43,
                 from /home/ss/build/external_libraries/boost/boost/algorithm/string/classification.hpp:15,
                 from /home/ss/build/external_libraries/boost/boost/algorithm/string/trim.hpp:23,
                 from /home/ss/build/external_libraries/boost/boost/algorithm/string.hpp:19,
                 from /home/ss/build/common/SC_DirUtils.h:37,
                 from /home/ss/build/lang/LangSource/SC_LanguageConfig.cpp:26:
/usr/include/c++/5/bits/unique_ptr.h:49:28: note: declared here
   template<typename> class auto_ptr;
                            ^
In file included from /home/ss/build/external_libraries/yaml-cpp-0.3.0/include/yaml-cpp/yaml.h:8:0,
                 from /home/ss/build/lang/LangSource/SC_LanguageConfig.cpp:45:
/home/ss/build/external_libraries/yaml-cpp-0.3.0/include/yaml-cpp/parser.h:47:8: warning: ‘template<class> class std::auto_ptr’ is deprecated [-Wdeprecated-declarations]
   std::auto_ptr<Directives> m_pDirectives;
        ^
In file included from /usr/include/c++/5/bits/locale_conv.h:41:0,
                 from /usr/include/c++/5/locale:43,
                 from /home/ss/build/external_libraries/boost/boost/algorithm/string/classification.hpp:15,
                 from /home/ss/build/external_libraries/boost/boost/algorithm/string/trim.hpp:23,
                 from /home/ss/build/external_libraries/boost/boost/algorithm/string.hpp:19,
                 from /home/ss/build/common/SC_DirUtils.h:37,
                 from /home/ss/build/lang/LangSource/SC_LanguageConfig.cpp:26:
/usr/include/c++/5/bits/unique_ptr.h:49:28: note: declared here
   template<typename> class auto_ptr;
                            ^
In file included from /home/ss/build/external_libraries/yaml-cpp-0.3.0/include/yaml-cpp/yaml.h:9:0,
                 from /home/ss/build/lang/LangSource/SC_LanguageConfig.cpp:45:
/home/ss/build/external_libraries/yaml-cpp-0.3.0/include/yaml-cpp/emitter.h:105:8: warning: ‘template<class> class std::auto_ptr’ is deprecated [-Wdeprecated-declarations]
   std::auto_ptr <EmitterState> m_pState;
        ^
In file included from /usr/include/c++/5/bits/locale_conv.h:41:0,
                 from /usr/include/c++/5/locale:43,
                 from /home/ss/build/external_libraries/boost/boost/algorithm/string/classification.hpp:15,
                 from /home/ss/build/external_libraries/boost/boost/algorithm/string/trim.hpp:23,
                 from /home/ss/build/external_libraries/boost/boost/algorithm/string.hpp:19,
                 from /home/ss/build/common/SC_DirUtils.h:37,
                 from /home/ss/build/lang/LangSource/SC_LanguageConfig.cpp:26:
/usr/include/c++/5/bits/unique_ptr.h:49:28: note: declared here
   template<typename> class auto_ptr;
                            ^
In file included from /home/ss/build/external_libraries/yaml-cpp-0.3.0/include/yaml-cpp/node.h:14:0,
                 from /home/ss/build/external_libraries/yaml-cpp-0.3.0/include/yaml-cpp/yaml.h:13,
                 from /home/ss/build/lang/LangSource/SC_LanguageConfig.cpp:45:
/home/ss/build/external_libraries/yaml-cpp-0.3.0/include/yaml-cpp/iterator.h:20:17: warning: ‘template<class> class std::auto_ptr’ is deprecated [-Wdeprecated-declarations]
   Iterator(std::auto_ptr<IterPriv> pData);
                 ^
In file included from /usr/include/c++/5/bits/locale_conv.h:41:0,
                 from /usr/include/c++/5/locale:43,
                 from /home/ss/build/external_libraries/boost/boost/algorithm/string/classification.hpp:15,
                 from /home/ss/build/external_libraries/boost/boost/algorithm/string/trim.hpp:23,
                 from /home/ss/build/external_libraries/boost/boost/algorithm/string.hpp:19,
                 from /home/ss/build/common/SC_DirUtils.h:37,
                 from /home/ss/build/lang/LangSource/SC_LanguageConfig.cpp:26:
/usr/include/c++/5/bits/unique_ptr.h:49:28: note: declared here
   template<typename> class auto_ptr;
                            ^
In file included from /home/ss/build/external_libraries/yaml-cpp-0.3.0/include/yaml-cpp/node.h:14:0,
                 from /home/ss/build/external_libraries/yaml-cpp-0.3.0/include/yaml-cpp/yaml.h:13,
                 from /home/ss/build/lang/LangSource/SC_LanguageConfig.cpp:45:
/home/ss/build/external_libraries/yaml-cpp-0.3.0/include/yaml-cpp/iterator.h:36:8: warning: ‘template<class> class std::auto_ptr’ is deprecated [-Wdeprecated-declarations]
   std::auto_ptr<IterPriv> m_pData;
        ^
In file included from /usr/include/c++/5/bits/locale_conv.h:41:0,
                 from /usr/include/c++/5/locale:43,
                 from /home/ss/build/external_libraries/boost/boost/algorithm/string/classification.hpp:15,
                 from /home/ss/build/external_libraries/boost/boost/algorithm/string/trim.hpp:23,
                 from /home/ss/build/external_libraries/boost/boost/algorithm/string.hpp:19,
                 from /home/ss/build/common/SC_DirUtils.h:37,
                 from /home/ss/build/lang/LangSource/SC_LanguageConfig.cpp:26:
/usr/include/c++/5/bits/unique_ptr.h:49:28: note: declared here
   template<typename> class auto_ptr;
                            ^
In file included from /home/ss/build/external_libraries/yaml-cpp-0.3.0/include/yaml-cpp/yaml.h:13:0,
                 from /home/ss/build/lang/LangSource/SC_LanguageConfig.cpp:45:
/home/ss/build/external_libraries/yaml-cpp-0.3.0/include/yaml-cpp/node.h:43:8: warning: ‘template<class> class std::auto_ptr’ is deprecated [-Wdeprecated-declarations]
   std::auto_ptr<Node> Clone() const;
        ^
In file included from /usr/include/c++/5/bits/locale_conv.h:41:0,
                 from /usr/include/c++/5/locale:43,
                 from /home/ss/build/external_libraries/boost/boost/algorithm/string/classification.hpp:15,
                 from /home/ss/build/external_libraries/boost/boost/algorithm/string/trim.hpp:23,
                 from /home/ss/build/external_libraries/boost/boost/algorithm/string.hpp:19,
                 from /home/ss/build/common/SC_DirUtils.h:37,
                 from /home/ss/build/lang/LangSource/SC_LanguageConfig.cpp:26:
/usr/include/c++/5/bits/unique_ptr.h:49:28: note: declared here
   template<typename> class auto_ptr;
                            ^
In file included from /home/ss/build/external_libraries/yaml-cpp-0.3.0/include/yaml-cpp/yaml.h:13:0,
                 from /home/ss/build/lang/LangSource/SC_LanguageConfig.cpp:45:
/home/ss/build/external_libraries/yaml-cpp-0.3.0/include/yaml-cpp/node.h:117:8: warning: ‘template<class> class std::auto_ptr’ is deprecated [-Wdeprecated-declarations]
   std::auto_ptr<NodeOwnership> m_pOwnership;
        ^
In file included from /usr/include/c++/5/bits/locale_conv.h:41:0,
                 from /usr/include/c++/5/locale:43,
                 from /home/ss/build/external_libraries/boost/boost/algorithm/string/classification.hpp:15,
                 from /home/ss/build/external_libraries/boost/boost/algorithm/string/trim.hpp:23,
                 from /home/ss/build/external_libraries/boost/boost/algorithm/string.hpp:19,
                 from /home/ss/build/common/SC_DirUtils.h:37,
                 from /home/ss/build/lang/LangSource/SC_LanguageConfig.cpp:26:
/usr/include/c++/5/bits/unique_ptr.h:49:28: note: declared here
   template<typename> class auto_ptr;
                            ^
[ 46%] Building CXX object lang/CMakeFiles/libsclang.dir/LangSource/SC_TerminalClient.cpp.o
[ 46%] Building CXX object lang/CMakeFiles/libsclang.dir/LangSource/SimpleStack.cpp.o
[ 46%] Building CXX object lang/CMakeFiles/libsclang.dir/LangSource/VMGlobals.cpp.o
[ 46%] Building CXX object lang/CMakeFiles/libsclang.dir/LangSource/dumpByteCodes.cpp.o
[ 47%] Building C object lang/CMakeFiles/libsclang.dir/__/common/fftlib.c.o
[ 47%] Building CXX object lang/CMakeFiles/libsclang.dir/__/common/Samp.cpp.o
[ 47%] Building CXX object lang/CMakeFiles/libsclang.dir/__/common/SC_AllocPool.cpp.o
[ 47%] Building CXX object lang/CMakeFiles/libsclang.dir/__/common/SC_DirUtils.cpp.o
[ 47%] Building CXX object lang/CMakeFiles/libsclang.dir/__/common/SC_Reply.cpp.o
[ 47%] Building CXX object lang/CMakeFiles/libsclang.dir/__/common/SC_StandAloneInfo_Darwin.cpp.o
[ 47%] Building CXX object lang/CMakeFiles/libsclang.dir/__/common/SC_StringBuffer.cpp.o
[ 48%] Building CXX object lang/CMakeFiles/libsclang.dir/__/common/SC_StringParser.cpp.o
[ 48%] Building CXX object lang/CMakeFiles/libsclang.dir/__/common/SC_TextUtils.cpp.o
[ 48%] Building CXX object lang/CMakeFiles/libsclang.dir/__/editors/sc-ide/primitives/localsocket_utils.cpp.o
[ 48%] Building CXX object lang/CMakeFiles/libsclang.dir/__/common/sc_popen.cpp.o
[ 48%] Building CXX object lang/CMakeFiles/libsclang.dir/__/external_libraries/boost/libs/filesystem/src/unique_path.cpp.o
[ 48%] Building CXX object lang/CMakeFiles/libsclang.dir/__/external_libraries/boost/libs/filesystem/src/operations.cpp.o
[ 49%] Building CXX object lang/CMakeFiles/libsclang.dir/__/external_libraries/boost/libs/filesystem/src/windows_file_codecvt.cpp.o
[ 49%] Building CXX object lang/CMakeFiles/libsclang.dir/__/external_libraries/boost/libs/filesystem/src/utf8_codecvt_facet.cpp.o
[ 49%] Building CXX object lang/CMakeFiles/libsclang.dir/__/external_libraries/boost/libs/filesystem/src/portability.cpp.o
[ 49%] Building CXX object lang/CMakeFiles/libsclang.dir/__/external_libraries/boost/libs/filesystem/src/path.cpp.o
[ 49%] Building CXX object lang/CMakeFiles/libsclang.dir/__/external_libraries/boost/libs/filesystem/src/path_traits.cpp.o
[ 49%] Building CXX object lang/CMakeFiles/libsclang.dir/__/external_libraries/boost/libs/filesystem/src/codecvt_error_category.cpp.o
[ 50%] Building CXX object lang/CMakeFiles/libsclang.dir/__/external_libraries/boost/libs/system/src/error_code.cpp.o
[ 50%] Building CXX object lang/CMakeFiles/libsclang.dir/__/external_libraries/boost/libs/regex/src/regex_raw_buffer.cpp.o
[ 50%] Building CXX object lang/CMakeFiles/libsclang.dir/__/external_libraries/boost/libs/regex/src/usinstances.cpp.o
[ 50%] Building CXX object lang/CMakeFiles/libsclang.dir/__/external_libraries/boost/libs/regex/src/c_regex_traits.cpp.o
[ 50%] Building CXX object lang/CMakeFiles/libsclang.dir/__/external_libraries/boost/libs/regex/src/instances.cpp.o
[ 50%] Building CXX object lang/CMakeFiles/libsclang.dir/__/external_libraries/boost/libs/regex/src/icu.cpp.o
[ 51%] Building CXX object lang/CMakeFiles/libsclang.dir/__/external_libraries/boost/libs/regex/src/regex_debug.cpp.o
[ 51%] Building CXX object lang/CMakeFiles/libsclang.dir/__/external_libraries/boost/libs/regex/src/posix_api.cpp.o
[ 51%] Building CXX object lang/CMakeFiles/libsclang.dir/__/external_libraries/boost/libs/regex/src/fileiter.cpp.o
[ 51%] Building CXX object lang/CMakeFiles/libsclang.dir/__/external_libraries/boost/libs/regex/src/regex_traits_defaults.cpp.o
[ 51%] Building CXX object lang/CMakeFiles/libsclang.dir/__/external_libraries/boost/libs/regex/src/wc_regex_traits.cpp.o
[ 51%] Building CXX object lang/CMakeFiles/libsclang.dir/__/external_libraries/boost/libs/regex/src/regex.cpp.o
[ 51%] Building CXX object lang/CMakeFiles/libsclang.dir/__/external_libraries/boost/libs/regex/src/cregex.cpp.o
[ 52%] Building CXX object lang/CMakeFiles/libsclang.dir/__/external_libraries/boost/libs/regex/src/winstances.cpp.o
[ 52%] Building CXX object lang/CMakeFiles/libsclang.dir/__/external_libraries/boost/libs/regex/src/cpp_regex_traits.cpp.o
[ 52%] Building CXX object lang/CMakeFiles/libsclang.dir/__/external_libraries/boost/libs/regex/src/static_mutex.cpp.o
[ 52%] Building CXX object lang/CMakeFiles/libsclang.dir/__/external_libraries/boost/libs/regex/src/w32_regex_traits.cpp.o
[ 52%] Building CXX object lang/CMakeFiles/libsclang.dir/__/external_libraries/boost/libs/regex/src/wide_posix_api.cpp.o
[ 52%] Building CXX object lang/CMakeFiles/libsclang.dir/LangPrimSource/PyrSerialPrim.cpp.o
[ 53%] Building CXX object lang/CMakeFiles/libsclang.dir/LangPrimSource/SC_AlsaMIDI.cpp.o
[ 53%] Building CXX object lang/CMakeFiles/libsclang.dir/LangPrimSource/SC_LID.cpp.o
[ 53%] Building CXX object lang/CMakeFiles/libsclang.dir/__/QtCollider/type_codec.cpp.o
[ 53%] Building CXX object lang/CMakeFiles/libsclang.dir/__/QtCollider/metatype.cpp.o
[ 53%] Building CXX object lang/CMakeFiles/libsclang.dir/__/QtCollider/debug.cpp.o
[ 53%] Building CXX object lang/CMakeFiles/libsclang.dir/__/QtCollider/interface.cpp.o
[ 54%] Building CXX object lang/CMakeFiles/libsclang.dir/__/QtCollider/factories.cpp.o
[ 54%] Building CXX object lang/CMakeFiles/libsclang.dir/__/QtCollider/QcApplication.cpp.o
[ 54%] Building CXX object lang/CMakeFiles/libsclang.dir/__/QtCollider/Common.cpp.o
[ 54%] Building CXX object lang/CMakeFiles/libsclang.dir/__/QtCollider/QObjectProxy.cpp.o
[ 54%] Building CXX object lang/CMakeFiles/libsclang.dir/__/QtCollider/QWidgetProxy.cpp.o
[ 54%] Building CXX object lang/CMakeFiles/libsclang.dir/__/QtCollider/QcObjectFactory.cpp.o
[ 55%] Building CXX object lang/CMakeFiles/libsclang.dir/__/QtCollider/QtDownload.cpp.o
[ 55%] Building CXX object lang/CMakeFiles/libsclang.dir/__/QtCollider/hacks/hacks_x11.cpp.o
[ 55%] Building CXX object lang/CMakeFiles/libsclang.dir/__/QtCollider/primitives/primitives.cpp.o
[ 55%] Building CXX object lang/CMakeFiles/libsclang.dir/__/QtCollider/primitives/prim_QObject.cpp.o
[ 55%] Building CXX object lang/CMakeFiles/libsclang.dir/__/QtCollider/primitives/prim_QPen.cpp.o
[ 55%] Building CXX object lang/CMakeFiles/libsclang.dir/__/QtCollider/primitives/prim_misc.cpp.o
[ 55%] Building CXX object lang/CMakeFiles/libsclang.dir/__/QtCollider/primitives/prim_QWidget.cpp.o
[ 56%] Building CXX object lang/CMakeFiles/libsclang.dir/__/QtCollider/primitives/prim_QPalette.cpp.o
[ 56%] Building CXX object lang/CMakeFiles/libsclang.dir/__/QtCollider/primitives/prim_QImage.cpp.o
[ 56%] Building CXX object lang/CMakeFiles/libsclang.dir/__/QtCollider/widgets/BasicWidgets.cpp.o
[ 56%] Building CXX object lang/CMakeFiles/libsclang.dir/__/QtCollider/widgets/QcButton.cpp.o
[ 56%] Building CXX object lang/CMakeFiles/libsclang.dir/__/QtCollider/widgets/QcListWidget.cpp.o
[ 56%] Building CXX object lang/CMakeFiles/libsclang.dir/__/QtCollider/widgets/QcPopUpMenu.cpp.o
[ 57%] Building CXX object lang/CMakeFiles/libsclang.dir/__/QtCollider/widgets/QcTreeWidget.cpp.o
[ 57%] Building CXX object lang/CMakeFiles/libsclang.dir/__/QtCollider/widgets/QcScrollArea.cpp.o
[ 57%] Building CXX object lang/CMakeFiles/libsclang.dir/__/QtCollider/widgets/QcAbstractStepValue.cpp.o
[ 57%] Building CXX object lang/CMakeFiles/libsclang.dir/__/QtCollider/widgets/QcNumberBox.cpp.o
[ 57%] Building CXX object lang/CMakeFiles/libsclang.dir/__/QtCollider/widgets/QcSlider.cpp.o
[ 57%] Building CXX object lang/CMakeFiles/libsclang.dir/__/QtCollider/widgets/QcSlider2D.cpp.o
[ 58%] Building CXX object lang/CMakeFiles/libsclang.dir/__/QtCollider/widgets/QcRangeSlider.cpp.o
[ 58%] Building CXX object lang/CMakeFiles/libsclang.dir/__/QtCollider/widgets/QcMultiSlider.cpp.o
[ 58%] Building CXX object lang/CMakeFiles/libsclang.dir/__/QtCollider/widgets/QcKnob.cpp.o
[ 58%] Building CXX object lang/CMakeFiles/libsclang.dir/__/QtCollider/widgets/QcTextEdit.cpp.o
[ 58%] Building CXX object lang/CMakeFiles/libsclang.dir/__/QtCollider/widgets/QcScope.cpp.o
[ 58%] Building CXX object lang/CMakeFiles/libsclang.dir/__/QtCollider/widgets/QcScopeShm.cpp.o
[ 59%] Building CXX object lang/CMakeFiles/libsclang.dir/__/QtCollider/widgets/QcLevelIndicator.cpp.o
[ 59%] Building CXX object lang/CMakeFiles/libsclang.dir/__/QtCollider/widgets/QcWindow.cpp.o
[ 59%] Building CXX object lang/CMakeFiles/libsclang.dir/__/QtCollider/widgets/QcGraph.cpp.o
[ 59%] Building CXX object lang/CMakeFiles/libsclang.dir/__/QtCollider/widgets/QcCanvas.cpp.o
[ 59%] Building CXX object lang/CMakeFiles/libsclang.dir/__/QtCollider/widgets/soundfileview/view.cpp.o
[ 59%] Building CXX object lang/CMakeFiles/libsclang.dir/__/QtCollider/widgets/soundfileview/filestream.cpp.o
[ 60%] Building CXX object lang/CMakeFiles/libsclang.dir/__/QtCollider/widgets/soundfileview/cachestream.cpp.o
[ 60%] Building CXX object lang/CMakeFiles/libsclang.dir/__/QtCollider/widgets/QcFileDialog.cpp.o
[ 60%] Building CXX object lang/CMakeFiles/libsclang.dir/__/QtCollider/widgets/QcPenPrinter.cpp.o
[ 60%] Building CXX object lang/CMakeFiles/libsclang.dir/__/QtCollider/widgets/QcWebView.cpp.o
[ 60%] Building CXX object lang/CMakeFiles/libsclang.dir/__/QtCollider/widgets/web_page.cpp.o
[ 60%] Building CXX object lang/CMakeFiles/libsclang.dir/__/QtCollider/layouts/layouts.cpp.o
[ 60%] Building CXX object lang/CMakeFiles/libsclang.dir/__/QtCollider/layouts/stack_layout.cpp.o
[ 61%] Building CXX object lang/CMakeFiles/libsclang.dir/__/QtCollider/style/ProxyStyle.cpp.o
[ 61%] Building CXX object lang/CMakeFiles/libsclang.dir/__/QtCollider/style/style.cpp.o
[ 61%] Building CXX object lang/CMakeFiles/libsclang.dir/__/QtCollider/LanguageClient.cpp.o
[ 61%] Building CXX object lang/CMakeFiles/libsclang.dir/__/QtCollider/moc_QcApplication.cpp.o
[ 61%] Building CXX object lang/CMakeFiles/libsclang.dir/__/QtCollider/moc_QObjectProxy.cpp.o
[ 61%] Building CXX object lang/CMakeFiles/libsclang.dir/__/QtCollider/moc_QWidgetProxy.cpp.o
[ 62%] Building CXX object lang/CMakeFiles/libsclang.dir/__/QtCollider/moc_QtDownload.cpp.o
[ 62%] Building CXX object lang/CMakeFiles/libsclang.dir/__/QtCollider/widgets/moc_BasicWidgets.cpp.o
[ 62%] Building CXX object lang/CMakeFiles/libsclang.dir/__/QtCollider/widgets/moc_QcButton.cpp.o
[ 62%] Building CXX object lang/CMakeFiles/libsclang.dir/__/QtCollider/widgets/moc_QcCheckBox.cpp.o
[ 62%] Building CXX object lang/CMakeFiles/libsclang.dir/__/QtCollider/widgets/moc_QcTextField.cpp.o
[ 62%] Building CXX object lang/CMakeFiles/libsclang.dir/__/QtCollider/widgets/moc_QcListWidget.cpp.o
[ 63%] Building CXX object lang/CMakeFiles/libsclang.dir/__/QtCollider/widgets/moc_QcPopUpMenu.cpp.o
[ 63%] Building CXX object lang/CMakeFiles/libsclang.dir/__/QtCollider/widgets/moc_QcTreeWidget.cpp.o
[ 63%] Building CXX object lang/CMakeFiles/libsclang.dir/__/QtCollider/widgets/moc_QcScrollArea.cpp.o
[ 63%] Building CXX object lang/CMakeFiles/libsclang.dir/__/QtCollider/widgets/moc_QcNumberBox.cpp.o
[ 63%] Building CXX object lang/CMakeFiles/libsclang.dir/__/QtCollider/widgets/moc_QcSlider.cpp.o
[ 63%] Building CXX object lang/CMakeFiles/libsclang.dir/__/QtCollider/widgets/moc_QcSlider2D.cpp.o
[ 64%] Building CXX object lang/CMakeFiles/libsclang.dir/__/QtCollider/widgets/moc_QcRangeSlider.cpp.o
[ 64%] Building CXX object lang/CMakeFiles/libsclang.dir/__/QtCollider/widgets/moc_QcMultiSlider.cpp.o
[ 64%] Building CXX object lang/CMakeFiles/libsclang.dir/__/QtCollider/widgets/moc_QcKnob.cpp.o
[ 64%] Building CXX object lang/CMakeFiles/libsclang.dir/__/QtCollider/widgets/moc_QcTextEdit.cpp.o
[ 64%] Building CXX object lang/CMakeFiles/libsclang.dir/__/QtCollider/widgets/moc_QcScope.cpp.o
[ 64%] Building CXX object lang/CMakeFiles/libsclang.dir/__/QtCollider/widgets/moc_QcScopeShm.cpp.o
[ 64%] Building CXX object lang/CMakeFiles/libsclang.dir/__/QtCollider/widgets/moc_QcGraph.cpp.o
[ 65%] Building CXX object lang/CMakeFiles/libsclang.dir/__/QtCollider/widgets/moc_QcLevelIndicator.cpp.o
[ 65%] Building CXX object lang/CMakeFiles/libsclang.dir/__/QtCollider/widgets/moc_QcCanvas.cpp.o
[ 65%] Building CXX object lang/CMakeFiles/libsclang.dir/__/QtCollider/widgets/soundfileview/moc_view.cpp.o
[ 65%] Building CXX object lang/CMakeFiles/libsclang.dir/__/QtCollider/widgets/moc_QcFileDialog.cpp.o
[ 65%] Building CXX object lang/CMakeFiles/libsclang.dir/__/QtCollider/widgets/moc_QcPenPrinter.cpp.o
[ 65%] Building CXX object lang/CMakeFiles/libsclang.dir/__/QtCollider/widgets/moc_QcWebView.cpp.o
[ 66%] Building CXX object lang/CMakeFiles/libsclang.dir/__/QtCollider/widgets/moc_web_page.cpp.o
[ 66%] Building CXX object lang/CMakeFiles/libsclang.dir/__/QtCollider/widgets/moc_QcWindow.cpp.o
[ 66%] Building CXX object lang/CMakeFiles/libsclang.dir/__/QtCollider/layouts/moc_layouts.cpp.o
[ 66%] Building CXX object lang/CMakeFiles/libsclang.dir/__/QtCollider/layouts/moc_stack_layout.cpp.o
[ 66%] Building CXX object lang/CMakeFiles/libsclang.dir/__/QtCollider/style/moc_style.cpp.o
[ 66%] Building CXX object lang/CMakeFiles/libsclang.dir/__/QtCollider/moc_LanguageClient.cpp.o
[ 67%] Building CXX object lang/CMakeFiles/libsclang.dir/qrc_resources.cpp.o
[ 67%] Building CXX object lang/CMakeFiles/libsclang.dir/__/editors/sc-ide/primitives/sc_ipc_client.cpp.o
In file included from /home/ss/build/editors/sc-ide/primitives/sc_ipc_client.cpp:28:0:
/home/ss/build/external_libraries/yaml-cpp-0.3.0/include/yaml-cpp/emitter.h:105:8: warning: ‘template<class> class std::auto_ptr’ is deprecated [-Wdeprecated-declarations]
   std::auto_ptr <EmitterState> m_pState;
        ^
In file included from /usr/include/c++/5/memory:81:0,
                 from /home/ss/build/external_libraries/yaml-cpp-0.3.0/include/yaml-cpp/emitter.h:15,
                 from /home/ss/build/editors/sc-ide/primitives/sc_ipc_client.cpp:28:
/usr/include/c++/5/bits/unique_ptr.h:49:28: note: declared here
   template<typename> class auto_ptr;
                            ^
In file included from /home/ss/build/external_libraries/yaml-cpp-0.3.0/include/yaml-cpp/node.h:14:0,
                 from /home/ss/build/editors/sc-ide/primitives/sc_ipc_client.cpp:29:
/home/ss/build/external_libraries/yaml-cpp-0.3.0/include/yaml-cpp/iterator.h:20:17: warning: ‘template<class> class std::auto_ptr’ is deprecated [-Wdeprecated-declarations]
   Iterator(std::auto_ptr<IterPriv> pData);
                 ^
In file included from /usr/include/c++/5/memory:81:0,
                 from /home/ss/build/external_libraries/yaml-cpp-0.3.0/include/yaml-cpp/emitter.h:15,
                 from /home/ss/build/editors/sc-ide/primitives/sc_ipc_client.cpp:28:
/usr/include/c++/5/bits/unique_ptr.h:49:28: note: declared here
   template<typename> class auto_ptr;
                            ^
In file included from /home/ss/build/external_libraries/yaml-cpp-0.3.0/include/yaml-cpp/node.h:14:0,
                 from /home/ss/build/editors/sc-ide/primitives/sc_ipc_client.cpp:29:
/home/ss/build/external_libraries/yaml-cpp-0.3.0/include/yaml-cpp/iterator.h:36:8: warning: ‘template<class> class std::auto_ptr’ is deprecated [-Wdeprecated-declarations]
   std::auto_ptr<IterPriv> m_pData;
        ^
In file included from /usr/include/c++/5/memory:81:0,
                 from /home/ss/build/external_libraries/yaml-cpp-0.3.0/include/yaml-cpp/emitter.h:15,
                 from /home/ss/build/editors/sc-ide/primitives/sc_ipc_client.cpp:28:
/usr/include/c++/5/bits/unique_ptr.h:49:28: note: declared here
   template<typename> class auto_ptr;
                            ^
In file included from /home/ss/build/editors/sc-ide/primitives/sc_ipc_client.cpp:29:0:
/home/ss/build/external_libraries/yaml-cpp-0.3.0/include/yaml-cpp/node.h:43:8: warning: ‘template<class> class std::auto_ptr’ is deprecated [-Wdeprecated-declarations]
   std::auto_ptr<Node> Clone() const;
        ^
In file included from /usr/include/c++/5/memory:81:0,
                 from /home/ss/build/external_libraries/yaml-cpp-0.3.0/include/yaml-cpp/emitter.h:15,
                 from /home/ss/build/editors/sc-ide/primitives/sc_ipc_client.cpp:28:
/usr/include/c++/5/bits/unique_ptr.h:49:28: note: declared here
   template<typename> class auto_ptr;
                            ^
In file included from /home/ss/build/editors/sc-ide/primitives/sc_ipc_client.cpp:29:0:
/home/ss/build/external_libraries/yaml-cpp-0.3.0/include/yaml-cpp/node.h:117:8: warning: ‘template<class> class std::auto_ptr’ is deprecated [-Wdeprecated-declarations]
   std::auto_ptr<NodeOwnership> m_pOwnership;
        ^
In file included from /usr/include/c++/5/memory:81:0,
                 from /home/ss/build/external_libraries/yaml-cpp-0.3.0/include/yaml-cpp/emitter.h:15,
                 from /home/ss/build/editors/sc-ide/primitives/sc_ipc_client.cpp:28:
/usr/include/c++/5/bits/unique_ptr.h:49:28: note: declared here
   template<typename> class auto_ptr;
                            ^
In file included from /home/ss/build/editors/sc-ide/primitives/sc_ipc_client.cpp:30:0:
/home/ss/build/external_libraries/yaml-cpp-0.3.0/include/yaml-cpp/parser.h:46:8: warning: ‘template<class> class std::auto_ptr’ is deprecated [-Wdeprecated-declarations]
   std::auto_ptr<Scanner> m_pScanner;
        ^
In file included from /usr/include/c++/5/memory:81:0,
                 from /home/ss/build/external_libraries/yaml-cpp-0.3.0/include/yaml-cpp/emitter.h:15,
                 from /home/ss/build/editors/sc-ide/primitives/sc_ipc_client.cpp:28:
/usr/include/c++/5/bits/unique_ptr.h:49:28: note: declared here
   template<typename> class auto_ptr;
                            ^
In file included from /home/ss/build/editors/sc-ide/primitives/sc_ipc_client.cpp:30:0:
/home/ss/build/external_libraries/yaml-cpp-0.3.0/include/yaml-cpp/parser.h:47:8: warning: ‘template<class> class std::auto_ptr’ is deprecated [-Wdeprecated-declarations]
   std::auto_ptr<Directives> m_pDirectives;
        ^
In file included from /usr/include/c++/5/memory:81:0,
                 from /home/ss/build/external_libraries/yaml-cpp-0.3.0/include/yaml-cpp/emitter.h:15,
                 from /home/ss/build/editors/sc-ide/primitives/sc_ipc_client.cpp:28:
/usr/include/c++/5/bits/unique_ptr.h:49:28: note: declared here
   template<typename> class auto_ptr;
                            ^
[ 67%] Building CXX object lang/CMakeFiles/libsclang.dir/__/editors/sc-ide/primitives/moc_sc_ipc_client.cpp.o
[ 67%] Building CXX object lang/CMakeFiles/libsclang.dir/__/SCDoc/SCDoc.cpp.o
[ 67%] Building CXX object lang/CMakeFiles/libsclang.dir/__/SCDoc/SCDoc.tab.cpp.o
[ 67%] Building CXX object lang/CMakeFiles/libsclang.dir/__/SCDoc/lex.scdoc.cpp.o
[ 68%] Building CXX object lang/CMakeFiles/libsclang.dir/__/SCDoc/SCDocPrim.cpp.o
[ 68%] Building CXX object lang/CMakeFiles/libsclang.dir/LangSource/Bison/lang11d_tab.cpp.o
[ 68%] Linking CXX static library libsclang.a
[ 68%] Built target libsclang
Scanning dependencies of target sclang
[ 69%] Building CXX object lang/CMakeFiles/sclang.dir/LangSource/cmdLineFuncs.cpp.o
[ 69%] Linking CXX executable sclang
/usr/bin/ld: warning: libgstreamer-0.10.so.0, needed by /home/ss/Qt/5.3/gcc_64/lib/libQt5WebKit.so.5.3.2, not found (try using -rpath or -rpath-link)
/usr/bin/ld: warning: libgstapp-0.10.so.0, needed by /home/ss/Qt/5.3/gcc_64/lib/libQt5WebKit.so.5.3.2, not found (try using -rpath or -rpath-link)
/usr/bin/ld: warning: libgstbase-0.10.so.0, needed by /home/ss/Qt/5.3/gcc_64/lib/libQt5WebKit.so.5.3.2, not found (try using -rpath or -rpath-link)
/usr/bin/ld: warning: libgstinterfaces-0.10.so.0, needed by /home/ss/Qt/5.3/gcc_64/lib/libQt5WebKit.so.5.3.2, not found (try using -rpath or -rpath-link)
/usr/bin/ld: warning: libgstpbutils-0.10.so.0, needed by /home/ss/Qt/5.3/gcc_64/lib/libQt5WebKit.so.5.3.2, not found (try using -rpath or -rpath-link)
/usr/bin/ld: warning: libgstvideo-0.10.so.0, needed by /home/ss/Qt/5.3/gcc_64/lib/libQt5WebKit.so.5.3.2, not found (try using -rpath or -rpath-link)
/home/ss/Qt/5.3/gcc_64/lib/libQt5WebKit.so.5.3.2: undefined reference to `gst_element_add_pad'
/home/ss/Qt/5.3/gcc_64/lib/libQt5WebKit.so.5.3.2: undefined reference to `gst_object_ref'
/home/ss/Qt/5.3/gcc_64/lib/libQt5WebKit.so.5.3.2: undefined reference to `gst_app_src_push_buffer'
/home/ss/Qt/5.3/gcc_64/lib/libQt5WebKit.so.5.3.2: undefined reference to `gst_element_query'
/home/ss/Qt/5.3/gcc_64/lib/libQt5WebKit.so.5.3.2: undefined reference to `gst_caps_get_type'
/home/ss/Qt/5.3/gcc_64/lib/libQt5WebKit.so.5.3.2: undefined reference to `gst_query_new_buffering'
/home/ss/Qt/5.3/gcc_64/lib/libQt5WebKit.so.5.3.2: undefined reference to `gst_element_query_position'
/home/ss/Qt/5.3/gcc_64/lib/libQt5WebKit.so.5.3.2: undefined reference to `gst_pad_get_parent_element'
/home/ss/Qt/5.3/gcc_64/lib/libQt5WebKit.so.5.3.2: undefined reference to `gst_tag_list_add'
/home/ss/Qt/5.3/gcc_64/lib/libQt5WebKit.so.5.3.2: undefined reference to `gst_iterator_resync'
/home/ss/Qt/5.3/gcc_64/lib/libQt5WebKit.so.5.3.2: undefined reference to `gst_pad_unlink'
/home/ss/Qt/5.3/gcc_64/lib/libQt5WebKit.so.5.3.2: undefined reference to `gst_message_parse_request_state'
/home/ss/Qt/5.3/gcc_64/lib/libQt5WebKit.so.5.3.2: undefined reference to `gst_query_new_segment'
/home/ss/Qt/5.3/gcc_64/lib/libQt5WebKit.so.5.3.2: undefined reference to `gst_mini_object_unref'
/home/ss/Qt/5.3/gcc_64/lib/libQt5WebKit.so.5.3.2: undefined reference to `gst_structure_get_int'
/home/ss/Qt/5.3/gcc_64/lib/libQt5WebKit.so.5.3.2: undefined reference to `_gst_debug_bin_to_dot_file_with_ts'
/home/ss/Qt/5.3/gcc_64/lib/libQt5WebKit.so.5.3.2: undefined reference to `gst_element_factory_find'
/home/ss/Qt/5.3/gcc_64/lib/libQt5WebKit.so.5.3.2: undefined reference to `gst_element_class_add_pad_template'
/home/ss/Qt/5.3/gcc_64/lib/libQt5WebKit.so.5.3.2: undefined reference to `gst_segment_set_duration'
/home/ss/Qt/5.3/gcc_64/lib/libQt5WebKit.so.5.3.2: undefined reference to `gst_pad_link'
/home/ss/Qt/5.3/gcc_64/lib/libQt5WebKit.so.5.3.2: undefined reference to `gst_uri_handler_get_type'
/home/ss/Qt/5.3/gcc_64/lib/libQt5WebKit.so.5.3.2: undefined reference to `gst_bin_remove_many'
/home/ss/Qt/5.3/gcc_64/lib/libQt5WebKit.so.5.3.2: undefined reference to `gst_bin_add_many'
/home/ss/Qt/5.3/gcc_64/lib/libQt5WebKit.so.5.3.2: undefined reference to `gst_bin_get_by_name'
/home/ss/Qt/5.3/gcc_64/lib/libQt5WebKit.so.5.3.2: undefined reference to `gst_x_overlay_set_window_handle'
/home/ss/Qt/5.3/gcc_64/lib/libQt5WebKit.so.5.3.2: undefined reference to `gst_message_get_structure'
/home/ss/Qt/5.3/gcc_64/lib/libQt5WebKit.so.5.3.2: undefined reference to `gst_element_seek'
/home/ss/Qt/5.3/gcc_64/lib/libQt5WebKit.so.5.3.2: undefined reference to `gst_iterator_free'
/home/ss/Qt/5.3/gcc_64/lib/libQt5WebKit.so.5.3.2: undefined reference to `gst_static_pad_template_get'
/home/ss/Qt/5.3/gcc_64/lib/libQt5WebKit.so.5.3.2: undefined reference to `gst_query_parse_nth_buffering_range'
/home/ss/Qt/5.3/gcc_64/lib/libQt5WebKit.so.5.3.2: undefined reference to `gst_element_message_full'
/home/ss/Qt/5.3/gcc_64/lib/libQt5WebKit.so.5.3.2: undefined reference to `gst_element_link_many'
/home/ss/Qt/5.3/gcc_64/lib/libQt5WebKit.so.5.3.2: undefined reference to `gst_plugin_feature_check_version'
/home/ss/Qt/5.3/gcc_64/lib/libQt5WebKit.so.5.3.2: undefined reference to `gst_pipeline_get_type'
/home/ss/Qt/5.3/gcc_64/lib/libQt5WebKit.so.5.3.2: undefined reference to `gst_x_overlay_get_type'
/home/ss/Qt/5.3/gcc_64/lib/libQt5WebKit.so.5.3.2: undefined reference to `gst_app_src_set_emit_signals'
/home/ss/Qt/5.3/gcc_64/lib/libQt5WebKit.so.5.3.2: undefined reference to `gst_uri_is_valid'
/home/ss/Qt/5.3/gcc_64/lib/libQt5WebKit.so.5.3.2: undefined reference to `gst_element_factory_make'
/home/ss/Qt/5.3/gcc_64/lib/libQt5WebKit.so.5.3.2: undefined reference to `gst_element_iterate_src_pads'
/home/ss/Qt/5.3/gcc_64/lib/libQt5WebKit.so.5.3.2: undefined reference to `gst_value_list_get_size'
/home/ss/Qt/5.3/gcc_64/lib/libQt5WebKit.so.5.3.2: undefined reference to `gst_buffer_copy_metadata'
/home/ss/Qt/5.3/gcc_64/lib/libQt5WebKit.so.5.3.2: undefined reference to `gst_element_post_message'
/home/ss/Qt/5.3/gcc_64/lib/libQt5WebKit.so.5.3.2: undefined reference to `gst_query_parse_buffering_range'
/home/ss/Qt/5.3/gcc_64/lib/libQt5WebKit.so.5.3.2: undefined reference to `gst_element_query_duration'
/home/ss/Qt/5.3/gcc_64/lib/libQt5WebKit.so.5.3.2: undefined reference to `gst_pipeline_get_bus'
/home/ss/Qt/5.3/gcc_64/lib/libQt5WebKit.so.5.3.2: undefined reference to `gst_pad_set_blocked'
/home/ss/Qt/5.3/gcc_64/lib/libQt5WebKit.so.5.3.2: undefined reference to `gst_message_new_request_state'
/home/ss/Qt/5.3/gcc_64/lib/libQt5WebKit.so.5.3.2: undefined reference to `gst_stream_error_quark'
/home/ss/Qt/5.3/gcc_64/lib/libQt5WebKit.so.5.3.2: undefined reference to `gst_implements_interface_cast'
/home/ss/Qt/5.3/gcc_64/lib/libQt5WebKit.so.5.3.2: undefined reference to `gst_query_set_duration'
/home/ss/Qt/5.3/gcc_64/lib/libQt5WebKit.so.5.3.2: undefined reference to `gst_value_get_structure'
/home/ss/Qt/5.3/gcc_64/lib/libQt5WebKit.so.5.3.2: undefined reference to `gst_buffer_new_and_alloc'
/home/ss/Qt/5.3/gcc_64/lib/libQt5WebKit.so.5.3.2: undefined reference to `gst_mini_object_replace'
/home/ss/Qt/5.3/gcc_64/lib/libQt5WebKit.so.5.3.2: undefined reference to `gst_query_new_position'
/home/ss/Qt/5.3/gcc_64/lib/libQt5WebKit.so.5.3.2: undefined reference to `gst_event_new_new_segment'
/home/ss/Qt/5.3/gcc_64/lib/libQt5WebKit.so.5.3.2: undefined reference to `gst_bin_add'
/home/ss/Qt/5.3/gcc_64/lib/libQt5WebKit.so.5.3.2: undefined reference to `gst_element_link_pads_full'
/home/ss/Qt/5.3/gcc_64/lib/libQt5WebKit.so.5.3.2: undefined reference to `gst_structure_free'
/home/ss/Qt/5.3/gcc_64/lib/libQt5WebKit.so.5.3.2: undefined reference to `gst_app_src_set_caps'
/home/ss/Qt/5.3/gcc_64/lib/libQt5WebKit.so.5.3.2: undefined reference to `gst_tag_list_free'
/home/ss/Qt/5.3/gcc_64/lib/libQt5WebKit.so.5.3.2: undefined reference to `gst_buffer_set_caps'
/home/ss/Qt/5.3/gcc_64/lib/libQt5WebKit.so.5.3.2: undefined reference to `gst_app_src_set_max_bytes'
/home/ss/Qt/5.3/gcc_64/lib/libQt5WebKit.so.5.3.2: undefined reference to `gst_mini_object_ref'
/home/ss/Qt/5.3/gcc_64/lib/libQt5WebKit.so.5.3.2: undefined reference to `gst_element_get_static_pad'
/home/ss/Qt/5.3/gcc_64/lib/libQt5WebKit.so.5.3.2: undefined reference to `gst_app_src_set_callbacks'
/home/ss/Qt/5.3/gcc_64/lib/libQt5WebKit.so.5.3.2: undefined reference to `gst_object_get_name'
/home/ss/Qt/5.3/gcc_64/lib/libQt5WebKit.so.5.3.2: undefined reference to `gst_ghost_pad_new_no_target_from_template'
/home/ss/Qt/5.3/gcc_64/lib/libQt5WebKit.so.5.3.2: undefined reference to `gst_app_src_set_size'
/home/ss/Qt/5.3/gcc_64/lib/libQt5WebKit.so.5.3.2: undefined reference to `gst_query_get_n_buffering_ranges'
/home/ss/Qt/5.3/gcc_64/lib/libQt5WebKit.so.5.3.2: undefined reference to `gst_element_class_set_details_simple'
/home/ss/Qt/5.3/gcc_64/lib/libQt5WebKit.so.5.3.2: undefined reference to `gst_message_parse_error'
/home/ss/Qt/5.3/gcc_64/lib/libQt5WebKit.so.5.3.2: undefined reference to `gst_buffer_get_type'
/home/ss/Qt/5.3/gcc_64/lib/libQt5WebKit.so.5.3.2: undefined reference to `gst_missing_plugin_message_get_installer_detail'
/home/ss/Qt/5.3/gcc_64/lib/libQt5WebKit.so.5.3.2: undefined reference to `gst_install_plugins_async'
/home/ss/Qt/5.3/gcc_64/lib/libQt5WebKit.so.5.3.2: undefined reference to `gst_bus_set_sync_handler'
/home/ss/Qt/5.3/gcc_64/lib/libQt5WebKit.so.5.3.2: undefined reference to `gst_implements_interface_check'
/home/ss/Qt/5.3/gcc_64/lib/libQt5WebKit.so.5.3.2: undefined reference to `gst_app_src_get_type'
/home/ss/Qt/5.3/gcc_64/lib/libQt5WebKit.so.5.3.2: undefined reference to `gst_core_error_quark'
/home/ss/Qt/5.3/gcc_64/lib/libQt5WebKit.so.5.3.2: undefined reference to `gst_ghost_pad_new_from_template'
/home/ss/Qt/5.3/gcc_64/lib/libQt5WebKit.so.5.3.2: undefined reference to `gst_query_parse_segment'
/home/ss/Qt/5.3/gcc_64/lib/libQt5WebKit.so.5.3.2: undefined reference to `gst_element_get_request_pad'
/home/ss/Qt/5.3/gcc_64/lib/libQt5WebKit.so.5.3.2: undefined reference to `gst_bin_get_type'
/home/ss/Qt/5.3/gcc_64/lib/libQt5WebKit.so.5.3.2: undefined reference to `gst_structure_get_string'
/home/ss/Qt/5.3/gcc_64/lib/libQt5WebKit.so.5.3.2: undefined reference to `gst_message_parse_state_changed'
/home/ss/Qt/5.3/gcc_64/lib/libQt5WebKit.so.5.3.2: undefined reference to `gst_stream_volume_get_volume'
/home/ss/Qt/5.3/gcc_64/lib/libQt5WebKit.so.5.3.2: undefined reference to `gst_message_type_get_name'
/home/ss/Qt/5.3/gcc_64/lib/libQt5WebKit.so.5.3.2: undefined reference to `gst_missing_element_message_new'
/home/ss/Qt/5.3/gcc_64/lib/libQt5WebKit.so.5.3.2: undefined reference to `gst_tag_list_is_empty'
/home/ss/Qt/5.3/gcc_64/lib/libQt5WebKit.so.5.3.2: undefined reference to `gst_bus_add_signal_watch'
/home/ss/Qt/5.3/gcc_64/lib/libQt5WebKit.so.5.3.2: undefined reference to `gst_pad_query'
/home/ss/Qt/5.3/gcc_64/lib/libQt5WebKit.so.5.3.2: undefined reference to `gst_uri_handler_set_uri'
/home/ss/Qt/5.3/gcc_64/lib/libQt5WebKit.so.5.3.2: undefined reference to `gst_video_parse_caps_pixel_aspect_ratio'
/home/ss/Qt/5.3/gcc_64/lib/libQt5WebKit.so.5.3.2: undefined reference to `gst_app_src_set_stream_type'
/home/ss/Qt/5.3/gcc_64/lib/libQt5WebKit.so.5.3.2: undefined reference to `gst_buffer_try_new_and_alloc'
/home/ss/Qt/5.3/gcc_64/lib/libQt5WebKit.so.5.3.2: undefined reference to `gst_iterator_next'
/home/ss/Qt/5.3/gcc_64/lib/libQt5WebKit.so.5.3.2: undefined reference to `gst_element_register'
/home/ss/Qt/5.3/gcc_64/lib/libQt5WebKit.so.5.3.2: undefined reference to `gst_structure_new'
/home/ss/Qt/5.3/gcc_64/lib/libQt5WebKit.so.5.3.2: undefined reference to `gst_element_state_change_return_get_name'
/home/ss/Qt/5.3/gcc_64/lib/libQt5WebKit.so.5.3.2: undefined reference to `gst_object_get_type'
/home/ss/Qt/5.3/gcc_64/lib/libQt5WebKit.so.5.3.2: undefined reference to `__gst_debug_min'
/home/ss/Qt/5.3/gcc_64/lib/libQt5WebKit.so.5.3.2: undefined reference to `gst_pad_query_duration'
/home/ss/Qt/5.3/gcc_64/lib/libQt5WebKit.so.5.3.2: undefined reference to `gst_pad_push_event'
/home/ss/Qt/5.3/gcc_64/lib/libQt5WebKit.so.5.3.2: undefined reference to `gst_element_get_state'
/home/ss/Qt/5.3/gcc_64/lib/libQt5WebKit.so.5.3.2: undefined reference to `gst_message_new_duration'
/home/ss/Qt/5.3/gcc_64/lib/libQt5WebKit.so.5.3.2: undefined reference to `gst_format_get_name'
/home/ss/Qt/5.3/gcc_64/lib/libQt5WebKit.so.5.3.2: undefined reference to `gst_element_factory_get_type'
/home/ss/Qt/5.3/gcc_64/lib/libQt5WebKit.so.5.3.2: undefined reference to `gst_structure_get_name'
/home/ss/Qt/5.3/gcc_64/lib/libQt5WebKit.so.5.3.2: undefined reference to `_gst_element_error_printf'
/home/ss/Qt/5.3/gcc_64/lib/libQt5WebKit.so.5.3.2: undefined reference to `gst_element_found_tags_for_pad'
/home/ss/Qt/5.3/gcc_64/lib/libQt5WebKit.so.5.3.2: undefined reference to `gst_element_release_request_pad'
/home/ss/Qt/5.3/gcc_64/lib/libQt5WebKit.so.5.3.2: undefined reference to `gst_caps_ref'
/home/ss/Qt/5.3/gcc_64/lib/libQt5WebKit.so.5.3.2: undefined reference to `gst_element_unlink_many'
/home/ss/Qt/5.3/gcc_64/lib/libQt5WebKit.so.5.3.2: undefined reference to `gst_element_get_type'
/home/ss/Qt/5.3/gcc_64/lib/libQt5WebKit.so.5.3.2: undefined reference to `gst_value_list_get_value'
/home/ss/Qt/5.3/gcc_64/lib/libQt5WebKit.so.5.3.2: undefined reference to `gst_plugin_feature_get_type'
/home/ss/Qt/5.3/gcc_64/lib/libQt5WebKit.so.5.3.2: undefined reference to `gst_debug_log'
/home/ss/Qt/5.3/gcc_64/lib/libQt5WebKit.so.5.3.2: undefined reference to `gst_query_parse_duration'
/home/ss/Qt/5.3/gcc_64/lib/libQt5WebKit.so.5.3.2: undefined reference to `gst_element_state_get_name'
/home/ss/Qt/5.3/gcc_64/lib/libQt5WebKit.so.5.3.2: undefined reference to `gst_video_sink_get_type'
/home/ss/Qt/5.3/gcc_64/lib/libQt5WebKit.so.5.3.2: undefined reference to `gst_caps_new_simple'
/home/ss/Qt/5.3/gcc_64/lib/libQt5WebKit.so.5.3.2: undefined reference to `gst_ghost_pad_get_target'
/home/ss/Qt/5.3/gcc_64/lib/libQt5WebKit.so.5.3.2: undefined reference to `gst_bin_new'
/home/ss/Qt/5.3/gcc_64/lib/libQt5WebKit.so.5.3.2: undefined reference to `gst_query_set_uri'
/home/ss/Qt/5.3/gcc_64/lib/libQt5WebKit.so.5.3.2: undefined reference to `gst_caps_replace'
/home/ss/Qt/5.3/gcc_64/lib/libQt5WebKit.so.5.3.2: undefined reference to `gst_util_uint64_scale_int'
/home/ss/Qt/5.3/gcc_64/lib/libQt5WebKit.so.5.3.2: undefined reference to `gst_bus_remove_signal_watch'
/home/ss/Qt/5.3/gcc_64/lib/libQt5WebKit.so.5.3.2: undefined reference to `gst_pad_set_query_function'
/home/ss/Qt/5.3/gcc_64/lib/libQt5WebKit.so.5.3.2: undefined reference to `_gst_debug_category_new'
/home/ss/Qt/5.3/gcc_64/lib/libQt5WebKit.so.5.3.2: undefined reference to `gst_structure_has_name'
/home/ss/Qt/5.3/gcc_64/lib/libQt5WebKit.so.5.3.2: undefined reference to `gst_structure_get_value'
/home/ss/Qt/5.3/gcc_64/lib/libQt5WebKit.so.5.3.2: undefined reference to `gst_bus_sync_signal_handler'
/home/ss/Qt/5.3/gcc_64/lib/libQt5WebKit.so.5.3.2: undefined reference to `gst_init_check'
/home/ss/Qt/5.3/gcc_64/lib/libQt5WebKit.so.5.3.2: undefined reference to `gst_caps_is_fixed'
/home/ss/Qt/5.3/gcc_64/lib/libQt5WebKit.so.5.3.2: undefined reference to `gst_video_format_parse_caps'
/home/ss/Qt/5.3/gcc_64/lib/libQt5WebKit.so.5.3.2: undefined reference to `gst_value_get_mini_object'
/home/ss/Qt/5.3/gcc_64/lib/libQt5WebKit.so.5.3.2: undefined reference to `gst_buffer_make_metadata_writable'
/home/ss/Qt/5.3/gcc_64/lib/libQt5WebKit.so.5.3.2: undefined reference to `gst_query_parse_position'
/home/ss/Qt/5.3/gcc_64/lib/libQt5WebKit.so.5.3.2: undefined reference to `gst_base_src_get_type'
/home/ss/Qt/5.3/gcc_64/lib/libQt5WebKit.so.5.3.2: undefined reference to `gst_stream_volume_get_type'
/home/ss/Qt/5.3/gcc_64/lib/libQt5WebKit.so.5.3.2: undefined reference to `gst_caps_unref'
/home/ss/Qt/5.3/gcc_64/lib/libQt5WebKit.so.5.3.2: undefined reference to `gst_base_sink_get_type'
/home/ss/Qt/5.3/gcc_64/lib/libQt5WebKit.so.5.3.2: undefined reference to `gst_stream_volume_set_volume'
/home/ss/Qt/5.3/gcc_64/lib/libQt5WebKit.so.5.3.2: undefined reference to `gst_app_src_end_of_stream'
/home/ss/Qt/5.3/gcc_64/lib/libQt5WebKit.so.5.3.2: undefined reference to `gst_structure_copy'
/home/ss/Qt/5.3/gcc_64/lib/libQt5WebKit.so.5.3.2: undefined reference to `gst_object_sink'
/home/ss/Qt/5.3/gcc_64/lib/libQt5WebKit.so.5.3.2: undefined reference to `gst_tag_list_new'
/home/ss/Qt/5.3/gcc_64/lib/libQt5WebKit.so.5.3.2: undefined reference to `gst_element_set_state'
/home/ss/Qt/5.3/gcc_64/lib/libQt5WebKit.so.5.3.2: undefined reference to `gst_resource_error_quark'
/home/ss/Qt/5.3/gcc_64/lib/libQt5WebKit.so.5.3.2: undefined reference to `gst_ghost_pad_new'
/home/ss/Qt/5.3/gcc_64/lib/libQt5WebKit.so.5.3.2: undefined reference to `gst_is_initialized'
/home/ss/Qt/5.3/gcc_64/lib/libQt5WebKit.so.5.3.2: undefined reference to `gst_is_missing_plugin_message'
/home/ss/Qt/5.3/gcc_64/lib/libQt5WebKit.so.5.3.2: undefined reference to `gst_object_unref'
collect2: error: ld returned 1 exit status
lang/CMakeFiles/sclang.dir/build.make:124: recipe for target 'lang/sclang' failed
make[2]: *** [lang/sclang] Error 1
CMakeFiles/Makefile2:3627: recipe for target 'lang/CMakeFiles/sclang.dir/all' failed
make[1]: *** [lang/CMakeFiles/sclang.dir/all] Error 2
Makefile:160: recipe for target 'all' failed
make: *** [all] Error 2

Reply | Threaded
Open this post in threaded view
|  
Report Content as Inappropriate

Re: Ubuntu build fail

Marinos Koutsomichalis-2
if you are compiling from build, it is:

cmake -DCMAKE_PREFIX_PATH=‘path/to/file’ ..

don’t forget the ‘..’ in the end, in POSIX systems ‘..’ stands for the parent directory which is the one holding the CMakeLists.txt file with the build instructions

m

> On 08 Jan 2017, at 10:35, lunar-lou <[hidden email]> wrote:
>
> As predicted.. here is my terminal readout.. What did i do wrong?   Thanks
>
>
> ss@ss:~$ mkdir build
> ss@ss:~$ cd build
> ss@ss:~/build$ cmake -DCMAKE_PREFIX_PATH= /home/ss/Qt/5.3
> CMake Error: The source directory "/home/ss/Qt/5.3" does not appear to contain CMakeLists.txt.
> Specify --help for usage, or press the help button on the CMake GUI.
> ss@ss:~/build$ cmake -DCMAKE_PREFIX_PATH=/home/ss/Qt/5.3/gcc_64/
> CMake Error: The source directory "/home/ss/build" does not appear to contain CMakeLists.txt.
> Specify --help for usage, or press the help button on the CMake GUI.
> ss@ss:~/build$ cmake -DCMAKE_PREFIX_PATH=/home/ss/Qt/5.3/gcc_64/
> -- The C compiler identification is GNU 5.4.0
> -- The CXX compiler identification is GNU 5.4.0
> -- Check for working C compiler: /usr/bin/cc
> -- Check for working C compiler: /usr/bin/cc -- works
> -- Detecting C compiler ABI info
> -- Detecting C compiler ABI info - done
> -- Detecting C compile features
> -- Detecting C compile features - done
> -- Check for working CXX compiler: /usr/bin/c++
> -- Check for working CXX compiler: /usr/bin/c++ -- works
> -- Detecting CXX compiler ABI info
> -- Detecting CXX compiler ABI info - done
> -- Detecting CXX compile features
> -- Detecting CXX compile features - done
> -- SuperCollider Version: 3.8.0
> -- Building from branch not_a_git_checkout, commit hash is na
> -- Build type defaulting to "RelWithDebInfo"
> CMake Warning at CMakeLists.txt:29 (message):
>   WARNING: IN-PLACE BUILDS ARE NOT RECOMMENDED - PLEASE USE A BUILD DIRECTORY
>
>
> -- Compiling with Qt GUI
> -- Found Pthreads: /usr/lib/x86_64-linux-gnu/libpthread.so  
> -- building boost libraries manually
> -- using bundled libyaml-cpp
> -- HIDAPI components:
> -- linux hidraw
> -- libudev stable: 1
> -- Found UDev: /usr/lib/x86_64-linux-gnu/libudev.so
> -- include: /usr/include
> -- hidapi_parser
> -- Using fftw3f
> -- Found Sndfile: /usr/lib/x86_64-linux-gnu/libsndfile.so  
> -- Looking for XOpenDisplay in /usr/lib/x86_64-linux-gnu/libX11.so;/usr/lib/x86_64-linux-gnu/libXext.so
> -- Looking for XOpenDisplay in /usr/lib/x86_64-linux-gnu/libX11.so;/usr/lib/x86_64-linux-gnu/libXext.so - found
> -- Looking for gethostbyname
> -- Looking for gethostbyname - found
> -- Looking for connect
> -- Looking for connect - found
> -- Looking for remove
> -- Looking for remove - found
> -- Looking for shmat
> -- Looking for shmat - found
> -- Looking for IceConnectionNumber in ICE
> -- Looking for IceConnectionNumber in ICE - found
> -- Found X11: /usr/lib/x86_64-linux-gnu/libX11.so
> -- Found PkgConfig: /usr/bin/pkg-config (found version "0.29.1")
> -- Checking for module 'jack'
> -- Found jack, version 1.9.11
> -- Found jack: /usr/lib/x86_64-linux-gnu/libjack.so
> -- Audio API: jack
> -- Could NOT find Avahi (missing: AVAHI_LIBRARY-COMMON AVAHI_LIBRARY-CLIENT AVAHI_INCLUDE_DIR)
> -- Found ALSA: /usr/lib/x86_64-linux-gnu/libasound.so (found version "1.1.0")
> -- Found GNU Readline version 6.3: /usr/lib/x86_64-linux-gnu/libreadline.so
> CMake Warning (dev) at /home/ss/Qt/5.3/gcc_64/lib/cmake/Qt5Core/Qt5CoreMacros.cmake:224 (configure_file):
>   configure_file called with unknown argument(s):
>
>    COPY_ONLY
>
> Call Stack (most recent call first):
>   QtCollider/CMakeLists.txt:137 (qt5_add_resources)
>   lang/CMakeLists.txt:182 (include)
> This warning is for project developers. Use -Wno-dev to suppress it.
>
> -- Found Qt: /home/ss/Qt/5.3/gcc_64/lib/libQt5Core.so.5.3.2
> -- Compiling with Readline support
> -- Compiling with ALSA midi support
> -- Building the Qt IDE
> CMake Warning (dev) at /home/ss/Qt/5.3/gcc_64/lib/cmake/Qt5Core/Qt5CoreMacros.cmake:224 (configure_file):
>   configure_file called with unknown argument(s):
>
>    COPY_ONLY
>
> Call Stack (most recent call first):
>   editors/sc-ide/CMakeLists.txt:237 (qt5_add_resources)
> This warning is for project developers. Use -Wno-dev to suppress it.
>
> CMake Error at editors/scel/el/CMakeLists.txt:21 (message):
>   Emacs could not be found.
>
>    (If emacs interface is not required, then set SC_EL=no)
>
>
> -- Building with Sced for gedit 3 (UNIX)
> -- Configuring incomplete, errors occurred!
> See also "/home/ss/build/CMakeFiles/CMakeOutput.log".
> ss@ss:~/build$ cmake -DCMAKE_PREFIX_PATH=/home/ss/Qt/5.3/gcc_64/ -SC_EL=no
> -- SuperCollider Version: 3.8.0
> -- Building from branch not_a_git_checkout, commit hash is na
> -- Build type defaulting to "RelWithDebInfo"
> CMake Warning at CMakeLists.txt:29 (message):
>   WARNING: IN-PLACE BUILDS ARE NOT RECOMMENDED - PLEASE USE A BUILD DIRECTORY
>
>
> -- Compiling with Qt GUI
> -- building boost libraries manually
> -- using bundled libyaml-cpp
> -- HIDAPI components:
> -- linux hidraw
> -- libudev stable: 1
> -- Found UDev: /usr/lib/x86_64-linux-gnu/libudev.so
> -- include: /usr/include
> -- hidapi_parser
> -- Using fftw3f
> -- Found jack: /usr/lib/x86_64-linux-gnu/libjack.so
> -- Audio API: jack
> -- Could NOT find Avahi (missing: AVAHI_LIBRARY-COMMON AVAHI_LIBRARY-CLIENT AVAHI_INCLUDE_DIR)
> -- Found GNU Readline version 6.3: /usr/lib/x86_64-linux-gnu/libreadline.so
> CMake Warning (dev) at /home/ss/Qt/5.3/gcc_64/lib/cmake/Qt5Core/Qt5CoreMacros.cmake:224 (configure_file):
>   configure_file called with unknown argument(s):
>
>    COPY_ONLY
>
> Call Stack (most recent call first):
>   QtCollider/CMakeLists.txt:137 (qt5_add_resources)
>   lang/CMakeLists.txt:182 (include)
> This warning is for project developers. Use -Wno-dev to suppress it.
>
> -- Found Qt: /home/ss/Qt/5.3/gcc_64/lib/libQt5Core.so.5.3.2
> -- Compiling with Readline support
> -- Compiling with ALSA midi support
> -- Building the Qt IDE
> CMake Warning (dev) at /home/ss/Qt/5.3/gcc_64/lib/cmake/Qt5Core/Qt5CoreMacros.cmake:224 (configure_file):
>   configure_file called with unknown argument(s):
>
>    COPY_ONLY
>
> Call Stack (most recent call first):
>   editors/sc-ide/CMakeLists.txt:237 (qt5_add_resources)
> This warning is for project developers. Use -Wno-dev to suppress it.
>
> CMake Error at editors/scel/el/CMakeLists.txt:21 (message):
>   Emacs could not be found.
>
>    (If emacs interface is not required, then set SC_EL=no)
>
>
> CMake Error at editors/scel/el/CMakeLists.txt:34 (add_custom_target):
>   add_custom_target cannot create target "sclang-vars.elc" because another
>   target with the same name already exists. The existing target is a custom
>   target created in source directory "/home/ss/build/editors/scel/el". See
>   documentation for policy CMP0002 for more details.
>
>
> -- Building with Sced for gedit 3 (UNIX)
> -- Configuring incomplete, errors occurred!
> See also "/home/ss/build/CMakeFiles/CMakeOutput.log".
> ss@ss:~/build$ cmake -DSC_EL=NO ..
> CMake Error: The source directory "/home/ss" does not appear to contain CMakeLists.txt.
> Specify --help for usage, or press the help button on the CMake GUI.
> ss@ss:~/build$ cd /home/ss/build/
> ss@ss:~/build$ dir
> AUTHORS CMakeFiles CPackConfig.cmake HelpSource platform SCVersion.txt
> build_sclang.cfg CMakeLists.txt CPackSourceConfig.cmake icons QtCollider server
> build_sclang.cfg.in cmake_modules DartConfiguration.tcl include README_LINUX.md sounds
> ChangeLog cmake_uninstall.cmake editors INSTALL README.md Testing
> CHANGELOG.md common examples lang SCClassLibrary testsuite
> CMakeCache.txt COPYING external_libraries package SCDoc travis_test_run_proto.json
> ss@ss:~/build$ cmake -DSC_EL=NO ..
> CMake Error: The source directory "/home/ss" does not appear to contain CMakeLists.txt.
> Specify --help for usage, or press the help button on the CMake GUI.
> ss@ss:~/build$ cmake -DSC_EL=NO
> -- SuperCollider Version: 3.8.0
> -- Building from branch not_a_git_checkout, commit hash is na
> -- Build type defaulting to "RelWithDebInfo"
> CMake Warning at CMakeLists.txt:29 (message):
>   WARNING: IN-PLACE BUILDS ARE NOT RECOMMENDED - PLEASE USE A BUILD DIRECTORY
>
>
> -- Compiling with Qt GUI
> -- building boost libraries manually
> -- using bundled libyaml-cpp
> -- HIDAPI components:
> -- linux hidraw
> -- libudev stable: 1
> -- Found UDev: /usr/lib/x86_64-linux-gnu/libudev.so
> -- include: /usr/include
> -- hidapi_parser
> -- Using fftw3f
> -- Found jack: /usr/lib/x86_64-linux-gnu/libjack.so
> -- Audio API: jack
> -- Could NOT find Avahi (missing: AVAHI_LIBRARY-COMMON AVAHI_LIBRARY-CLIENT AVAHI_INCLUDE_DIR)
> -- Found GNU Readline version 6.3: /usr/lib/x86_64-linux-gnu/libreadline.so
> CMake Warning (dev) at /home/ss/Qt/5.3/gcc_64/lib/cmake/Qt5Core/Qt5CoreMacros.cmake:224 (configure_file):
>   configure_file called with unknown argument(s):
>
>    COPY_ONLY
>
> Call Stack (most recent call first):
>   QtCollider/CMakeLists.txt:137 (qt5_add_resources)
>   lang/CMakeLists.txt:182 (include)
> This warning is for project developers. Use -Wno-dev to suppress it.
>
> -- Found Qt: /home/ss/Qt/5.3/gcc_64/lib/libQt5Core.so.5.3.2
> -- Compiling with Readline support
> -- Compiling with ALSA midi support
> -- Building the Qt IDE
> CMake Warning (dev) at /home/ss/Qt/5.3/gcc_64/lib/cmake/Qt5Core/Qt5CoreMacros.cmake:224 (configure_file):
>   configure_file called with unknown argument(s):
>
>    COPY_ONLY
>
> Call Stack (most recent call first):
>   editors/sc-ide/CMakeLists.txt:237 (qt5_add_resources)
> This warning is for project developers. Use -Wno-dev to suppress it.
>
> -- Building with Sced for gedit 3 (UNIX)
> -- Configuring done
> -- Generating done
> -- Build files have been written to: /home/ss/build
> ss@ss:~/build$ cmake -DCMAKE_PREFIX_PATH=/home/ss/Qt/5.3/gcc_64/
> -- SuperCollider Version: 3.8.0
> -- Building from branch not_a_git_checkout, commit hash is na
> -- Build type defaulting to "RelWithDebInfo"
> CMake Warning at CMakeLists.txt:29 (message):
>   WARNING: IN-PLACE BUILDS ARE NOT RECOMMENDED - PLEASE USE A BUILD DIRECTORY
>
>
> -- Compiling with Qt GUI
> -- building boost libraries manually
> -- using bundled libyaml-cpp
> -- HIDAPI components:
> -- linux hidraw
> -- libudev stable: 1
> -- Found UDev: /usr/lib/x86_64-linux-gnu/libudev.so
> -- include: /usr/include
> -- hidapi_parser
> -- Using fftw3f
> -- Found jack: /usr/lib/x86_64-linux-gnu/libjack.so
> -- Audio API: jack
> -- Could NOT find Avahi (missing: AVAHI_LIBRARY-COMMON AVAHI_LIBRARY-CLIENT AVAHI_INCLUDE_DIR)
> -- Found GNU Readline version 6.3: /usr/lib/x86_64-linux-gnu/libreadline.so
> CMake Warning (dev) at /home/ss/Qt/5.3/gcc_64/lib/cmake/Qt5Core/Qt5CoreMacros.cmake:224 (configure_file):
>   configure_file called with unknown argument(s):
>
>    COPY_ONLY
>
> Call Stack (most recent call first):
>   QtCollider/CMakeLists.txt:137 (qt5_add_resources)
>   lang/CMakeLists.txt:182 (include)
> This warning is for project developers. Use -Wno-dev to suppress it.
>
> -- Found Qt: /home/ss/Qt/5.3/gcc_64/lib/libQt5Core.so.5.3.2
> -- Compiling with Readline support
> -- Compiling with ALSA midi support
> -- Building the Qt IDE
> CMake Warning (dev) at /home/ss/Qt/5.3/gcc_64/lib/cmake/Qt5Core/Qt5CoreMacros.cmake:224 (configure_file):
>   configure_file called with unknown argument(s):
>
>    COPY_ONLY
>
> Call Stack (most recent call first):
>   editors/sc-ide/CMakeLists.txt:237 (qt5_add_resources)
> This warning is for project developers. Use -Wno-dev to suppress it.
>
> -- Building with Sced for gedit 3 (UNIX)
> -- Configuring done
> -- Generating done
> -- Build files have been written to: /home/ss/build
> ss@ss:~/build$ make install
> Scanning dependencies of target tlsf
> [ 0%] Building C object external_libraries/CMakeFiles/tlsf.dir/TLSF-2.4.6/src/tlsf.c.o
> [ 0%] Linking C static library libtlsf.a
> [ 0%] Built target tlsf
> Scanning dependencies of target yaml
> [ 0%] Building CXX object external_libraries/CMakeFiles/yaml.dir/libyamlcpp.cpp.o
> [ 1%] Linking CXX static library libyaml.a
> [ 1%] Built target yaml
> Scanning dependencies of target hidapi
> [ 1%] Building C object external_libraries/hidapi/linux/CMakeFiles/hidapi.dir/hid.c.o
> [ 1%] Linking C static library libhidapi.a
> [ 1%] Built target hidapi
> Scanning dependencies of target hidapi_parser
> [ 1%] Building C object external_libraries/hidapi/hidapi_parser/CMakeFiles/hidapi_parser.dir/hidapi_parser.c.o
> [ 1%] Linking C static library libhidapi_parser.a
> [ 1%] Built target hidapi_parser
> Scanning dependencies of target DiskIO_UGens_supernova
> [ 2%] Building CXX object server/plugins/CMakeFiles/DiskIO_UGens_supernova.dir/DiskIO_UGens.cpp.o
> [ 2%] Linking CXX shared module DiskIO_UGens_supernova.so
> [ 2%] Built target DiskIO_UGens_supernova
> Scanning dependencies of target UIUGens_supernova
> [ 2%] Building CXX object server/plugins/CMakeFiles/UIUGens_supernova.dir/UIUGens.cpp.o
> [ 2%] Linking CXX shared module UIUGens_supernova.so
> [ 2%] Built target UIUGens_supernova
> Scanning dependencies of target PV_ThirdParty_supernova
> [ 2%] Building CXX object server/plugins/CMakeFiles/PV_ThirdParty_supernova.dir/Convolution.cpp.o
> [ 2%] Building CXX object server/plugins/CMakeFiles/PV_ThirdParty_supernova.dir/FFT2InterfaceTable.cpp.o
> [ 3%] Building CXX object server/plugins/CMakeFiles/PV_ThirdParty_supernova.dir/FeatureDetection.cpp.o
> [ 3%] Building CXX object server/plugins/CMakeFiles/PV_ThirdParty_supernova.dir/PV_ThirdParty.cpp.o
> [ 3%] Linking CXX shared module PV_ThirdParty_supernova.so
> [ 3%] Built target PV_ThirdParty_supernova
> Scanning dependencies of target TriggerUGens
> [ 3%] Building CXX object server/plugins/CMakeFiles/TriggerUGens.dir/TriggerUGens.cpp.o
> [ 3%] Linking CXX shared module TriggerUGens.so
> [ 3%] Built target TriggerUGens
> Scanning dependencies of target PV_ThirdParty
> [ 3%] Building CXX object server/plugins/CMakeFiles/PV_ThirdParty.dir/Convolution.cpp.o
> [ 4%] Building CXX object server/plugins/CMakeFiles/PV_ThirdParty.dir/FFT2InterfaceTable.cpp.o
> [ 4%] Building CXX object server/plugins/CMakeFiles/PV_ThirdParty.dir/FeatureDetection.cpp.o
> [ 4%] Building CXX object server/plugins/CMakeFiles/PV_ThirdParty.dir/PV_ThirdParty.cpp.o
> [ 4%] Linking CXX shared module PV_ThirdParty.so
> [ 4%] Built target PV_ThirdParty
> Scanning dependencies of target LFUGens
> [ 4%] Building CXX object server/plugins/CMakeFiles/LFUGens.dir/LFUGens.cpp.o
> [ 4%] Linking CXX shared module LFUGens.so
> [ 4%] Built target LFUGens
> Scanning dependencies of target ReverbUGens
> [ 4%] Building CXX object server/plugins/CMakeFiles/ReverbUGens.dir/ReverbUGens.cpp.o
> [ 5%] Linking CXX shared module ReverbUGens.so
> [ 5%] Built target ReverbUGens
> Scanning dependencies of target FFT_UGens
> [ 6%] Building CXX object server/plugins/CMakeFiles/FFT_UGens.dir/FFTInterfaceTable.cpp.o
> [ 6%] Building CXX object server/plugins/CMakeFiles/FFT_UGens.dir/FFT_UGens.cpp.o
> [ 6%] Building CXX object server/plugins/CMakeFiles/FFT_UGens.dir/PV_UGens.cpp.o
> [ 6%] Building CXX object server/plugins/CMakeFiles/FFT_UGens.dir/PartitionedConvolution.cpp.o
> [ 6%] Linking CXX shared module FFT_UGens.so
> [ 6%] Built target FFT_UGens
> Scanning dependencies of target MulAddUGens
> [ 7%] Building CXX object server/plugins/CMakeFiles/MulAddUGens.dir/MulAddUGens.cpp.o
> [ 7%] Linking CXX shared module MulAddUGens.so
> [ 7%] Built target MulAddUGens
> Scanning dependencies of target UnpackFFTUGens
> [ 7%] Building CXX object server/plugins/CMakeFiles/UnpackFFTUGens.dir/UnpackFFTUGens.cpp.o
> [ 7%] Linking CXX shared module UnpackFFTUGens.so
> [ 7%] Built target UnpackFFTUGens
> Scanning dependencies of target TestUGens_supernova
> [ 7%] Building CXX object server/plugins/CMakeFiles/TestUGens_supernova.dir/TestUGens.cpp.o
> [ 8%] Linking CXX shared module TestUGens_supernova.so
> [ 8%] Built target TestUGens_supernova
> Scanning dependencies of target PanUGens
> [ 8%] Building CXX object server/plugins/CMakeFiles/PanUGens.dir/PanUGens.cpp.o
> [ 8%] Linking CXX shared module PanUGens.so
> [ 8%] Built target PanUGens
> Scanning dependencies of target ChaosUGens_supernova
> [ 9%] Building CXX object server/plugins/CMakeFiles/ChaosUGens_supernova.dir/ChaosUGens.cpp.o
> [ 9%] Linking CXX shared module ChaosUGens_supernova.so
> [ 9%] Built target ChaosUGens_supernova
> Scanning dependencies of target ML_UGens_supernova
> [ 9%] Building CXX object server/plugins/CMakeFiles/ML_UGens_supernova.dir/ML.cpp.o
> [ 9%] Building CXX object server/plugins/CMakeFiles/ML_UGens_supernova.dir/Loudness.cpp.o
> [ 9%] Building CXX object server/plugins/CMakeFiles/ML_UGens_supernova.dir/BeatTrack.cpp.o
> [ 9%] Building CXX object server/plugins/CMakeFiles/ML_UGens_supernova.dir/Onsets.cpp.o
> [ 10%] Building C object server/plugins/CMakeFiles/ML_UGens_supernova.dir/onsetsds.c.o
> [ 10%] Building CXX object server/plugins/CMakeFiles/ML_UGens_supernova.dir/KeyTrack.cpp.o
> [ 10%] Building CXX object server/plugins/CMakeFiles/ML_UGens_supernova.dir/MFCC.cpp.o
> [ 10%] Building CXX object server/plugins/CMakeFiles/ML_UGens_supernova.dir/BeatTrack2.cpp.o
> [ 10%] Building CXX object server/plugins/CMakeFiles/ML_UGens_supernova.dir/ML_SpecStats.cpp.o
> [ 10%] Linking CXX shared module ML_UGens_supernova.so
> [ 10%] Built target ML_UGens_supernova
> Scanning dependencies of target IOUGens
> [ 10%] Building CXX object server/plugins/CMakeFiles/IOUGens.dir/IOUGens.cpp.o
> [ 10%] Linking CXX shared module IOUGens.so
> [ 10%] Built target IOUGens
> Scanning dependencies of target PhysicalModelingUGens_supernova
> [ 10%] Building CXX object server/plugins/CMakeFiles/PhysicalModelingUGens_supernova.dir/PhysicalModelingUGens.cpp.o
> [ 10%] Linking CXX shared module PhysicalModelingUGens_supernova.so
> [ 10%] Built target PhysicalModelingUGens_supernova
> Scanning dependencies of target DemandUGens
> [ 11%] Building CXX object server/plugins/CMakeFiles/DemandUGens.dir/DemandUGens.cpp.o
> [ 11%] Linking CXX shared module DemandUGens.so
> [ 11%] Built target DemandUGens
> Scanning dependencies of target MulAddUGens_supernova
> [ 11%] Building CXX object server/plugins/CMakeFiles/MulAddUGens_supernova.dir/MulAddUGens.cpp.o
> [ 11%] Linking CXX shared module MulAddUGens_supernova.so
> [ 11%] Built target MulAddUGens_supernova
> Scanning dependencies of target UIUGens
> [ 11%] Building CXX object server/plugins/CMakeFiles/UIUGens.dir/UIUGens.cpp.o
> [ 12%] Linking CXX shared module UIUGens.so
> [ 12%] Built target UIUGens
> Scanning dependencies of target UnaryOpUGens
> [ 12%] Building CXX object server/plugins/CMakeFiles/UnaryOpUGens.dir/UnaryOpUGens.cpp.o
> [ 12%] Linking CXX shared module UnaryOpUGens.so
> [ 12%] Built target UnaryOpUGens
> Scanning dependencies of target ChaosUGens
> [ 12%] Building CXX object server/plugins/CMakeFiles/ChaosUGens.dir/ChaosUGens.cpp.o
> [ 12%] Linking CXX shared module ChaosUGens.so
> [ 12%] Built target ChaosUGens
> Scanning dependencies of target BinaryOpUGens
> [ 12%] Building CXX object server/plugins/CMakeFiles/BinaryOpUGens.dir/BinaryOpUGens.cpp.o
> [ 12%] Linking CXX shared module BinaryOpUGens.so
> [ 12%] Built target BinaryOpUGens
> Scanning dependencies of target FFT_UGens_supernova
> [ 12%] Building CXX object server/plugins/CMakeFiles/FFT_UGens_supernova.dir/FFTInterfaceTable.cpp.o
> [ 12%] Building CXX object server/plugins/CMakeFiles/FFT_UGens_supernova.dir/FFT_UGens.cpp.o
> [ 13%] Building CXX object server/plugins/CMakeFiles/FFT_UGens_supernova.dir/PV_UGens.cpp.o
> [ 13%] Building CXX object server/plugins/CMakeFiles/FFT_UGens_supernova.dir/PartitionedConvolution.cpp.o
> [ 13%] Linking CXX shared module FFT_UGens_supernova.so
> [ 13%] Built target FFT_UGens_supernova
> Scanning dependencies of target FilterUGens
> [ 13%] Building CXX object server/plugins/CMakeFiles/FilterUGens.dir/FilterUGens.cpp.o
> [ 13%] Linking CXX shared module FilterUGens.so
> [ 13%] Built target FilterUGens
> Scanning dependencies of target OscUGens
> [ 13%] Building CXX object server/plugins/CMakeFiles/OscUGens.dir/OscUGens.cpp.o
> [ 13%] Linking CXX shared module OscUGens.so
> [ 13%] Built target OscUGens
> Scanning dependencies of target DemandUGens_supernova
> [ 13%] Building CXX object server/plugins/CMakeFiles/DemandUGens_supernova.dir/DemandUGens.cpp.o
> [ 13%] Linking CXX shared module DemandUGens_supernova.so
> [ 13%] Built target DemandUGens_supernova
> Scanning dependencies of target LFUGens_supernova
> [ 13%] Building CXX object server/plugins/CMakeFiles/LFUGens_supernova.dir/LFUGens.cpp.o
> [ 13%] Linking CXX shared module LFUGens_supernova.so
> [ 13%] Built target LFUGens_supernova
> Scanning dependencies of target GrainUGens_supernova
> [ 13%] Building CXX object server/plugins/CMakeFiles/GrainUGens_supernova.dir/GrainUGens.cpp.o
> [ 13%] Linking CXX shared module GrainUGens_supernova.so
> [ 13%] Built target GrainUGens_supernova
> Scanning dependencies of target PhysicalModelingUGens
> [ 13%] Building CXX object server/plugins/CMakeFiles/PhysicalModelingUGens.dir/PhysicalModelingUGens.cpp.o
> [ 13%] Linking CXX shared module PhysicalModelingUGens.so
> [ 13%] Built target PhysicalModelingUGens
> Scanning dependencies of target GendynUGens
> [ 13%] Building CXX object server/plugins/CMakeFiles/GendynUGens.dir/GendynUGens.cpp.o
> [ 13%] Linking CXX shared module GendynUGens.so
> [ 13%] Built target GendynUGens
> Scanning dependencies of target TestUGens
> [ 13%] Building CXX object server/plugins/CMakeFiles/TestUGens.dir/TestUGens.cpp.o
> [ 13%] Linking CXX shared module TestUGens.so
> [ 13%] Built target TestUGens
> Scanning dependencies of target DelayUGens_supernova
> [ 13%] Building CXX object server/plugins/CMakeFiles/DelayUGens_supernova.dir/DelayUGens.cpp.o
> [ 13%] Linking CXX shared module DelayUGens_supernova.so
> [ 13%] Built target DelayUGens_supernova
> Scanning dependencies of target GrainUGens
> [ 13%] Building CXX object server/plugins/CMakeFiles/GrainUGens.dir/GrainUGens.cpp.o
> [ 14%] Linking CXX shared module GrainUGens.so
> [ 14%] Built target GrainUGens
> Scanning dependencies of target GendynUGens_supernova
> [ 14%] Building CXX object server/plugins/CMakeFiles/GendynUGens_supernova.dir/GendynUGens.cpp.o
> [ 14%] Linking CXX shared module GendynUGens_supernova.so
> [ 14%] Built target GendynUGens_supernova
> Scanning dependencies of target TriggerUGens_supernova
> [ 14%] Building CXX object server/plugins/CMakeFiles/TriggerUGens_supernova.dir/TriggerUGens.cpp.o
> [ 14%] Linking CXX shared module TriggerUGens_supernova.so
> [ 14%] Built target TriggerUGens_supernova
> Scanning dependencies of target ML_UGens
> [ 14%] Building CXX object server/plugins/CMakeFiles/ML_UGens.dir/ML.cpp.o
> [ 14%] Building CXX object server/plugins/CMakeFiles/ML_UGens.dir/Loudness.cpp.o
> [ 15%] Building CXX object server/plugins/CMakeFiles/ML_UGens.dir/BeatTrack.cpp.o
> [ 15%] Building CXX object server/plugins/CMakeFiles/ML_UGens.dir/Onsets.cpp.o
> [ 15%] Building C object server/plugins/CMakeFiles/ML_UGens.dir/onsetsds.c.o
> [ 15%] Building CXX object server/plugins/CMakeFiles/ML_UGens.dir/KeyTrack.cpp.o
> [ 15%] Building CXX object server/plugins/CMakeFiles/ML_UGens.dir/MFCC.cpp.o
> [ 15%] Building CXX object server/plugins/CMakeFiles/ML_UGens.dir/BeatTrack2.cpp.o
> [ 16%] Building CXX object server/plugins/CMakeFiles/ML_UGens.dir/ML_SpecStats.cpp.o
> [ 16%] Linking CXX shared module ML_UGens.so
> [ 16%] Built target ML_UGens
> Scanning dependencies of target DelayUGens
> [ 16%] Building CXX object server/plugins/CMakeFiles/DelayUGens.dir/DelayUGens.cpp.o
> [ 16%] Linking CXX shared module DelayUGens.so
> [ 16%] Built target DelayUGens
> Scanning dependencies of target IOUGens_supernova
> [ 16%] Building CXX object server/plugins/CMakeFiles/IOUGens_supernova.dir/IOUGens.cpp.o
> [ 17%] Linking CXX shared module IOUGens_supernova.so
> [ 17%] Built target IOUGens_supernova
> Scanning dependencies of target DiskIO_UGens
> [ 17%] Building CXX object server/plugins/CMakeFiles/DiskIO_UGens.dir/DiskIO_UGens.cpp.o
> [ 17%] Linking CXX shared module DiskIO_UGens.so
> [ 17%] Built target DiskIO_UGens
> Scanning dependencies of target DynNoiseUGens
> [ 17%] Building CXX object server/plugins/CMakeFiles/DynNoiseUGens.dir/DynNoiseUGens.cpp.o
> [ 17%] Linking CXX shared module DynNoiseUGens.so
> [ 17%] Built target DynNoiseUGens
> Scanning dependencies of target BinaryOpUGens_supernova
> [ 17%] Building CXX object server/plugins/CMakeFiles/BinaryOpUGens_supernova.dir/BinaryOpUGens.cpp.o
> [ 17%] Linking CXX shared module BinaryOpUGens_supernova.so
> [ 17%] Built target BinaryOpUGens_supernova
> Scanning dependencies of target NoiseUGens_supernova
> [ 18%] Building CXX object server/plugins/CMakeFiles/NoiseUGens_supernova.dir/NoiseUGens.cpp.o
> [ 18%] Linking CXX shared module NoiseUGens_supernova.so
> [ 18%] Built target NoiseUGens_supernova
> Scanning dependencies of target NoiseUGens
> [ 18%] Building CXX object server/plugins/CMakeFiles/NoiseUGens.dir/NoiseUGens.cpp.o
> [ 18%] Linking CXX shared module NoiseUGens.so
> [ 18%] Built target NoiseUGens
> Scanning dependencies of target OscUGens_supernova
> [ 18%] Building CXX object server/plugins/CMakeFiles/OscUGens_supernova.dir/OscUGens.cpp.o
> [ 18%] Linking CXX shared module OscUGens_supernova.so
> [ 18%] Built target OscUGens_supernova
> Scanning dependencies of target FilterUGens_supernova
> [ 18%] Building CXX object server/plugins/CMakeFiles/FilterUGens_supernova.dir/FilterUGens.cpp.o
> [ 19%] Linking CXX shared module FilterUGens_supernova.so
> [ 19%] Built target FilterUGens_supernova
> Scanning dependencies of target DynNoiseUGens_supernova
> [ 19%] Building CXX object server/plugins/CMakeFiles/DynNoiseUGens_supernova.dir/DynNoiseUGens.cpp.o
> [ 19%] Linking CXX shared module DynNoiseUGens_supernova.so
> [ 19%] Built target DynNoiseUGens_supernova
> Scanning dependencies of target PanUGens_supernova
> [ 19%] Building CXX object server/plugins/CMakeFiles/PanUGens_supernova.dir/PanUGens.cpp.o
> [ 20%] Linking CXX shared module PanUGens_supernova.so
> [ 20%] Built target PanUGens_supernova
> Scanning dependencies of target ReverbUGens_supernova
> [ 20%] Building CXX object server/plugins/CMakeFiles/ReverbUGens_supernova.dir/ReverbUGens.cpp.o
> [ 20%] Linking CXX shared module ReverbUGens_supernova.so
> [ 20%] Built target ReverbUGens_supernova
> Scanning dependencies of target UnaryOpUGens_supernova
> [ 20%] Building CXX object server/plugins/CMakeFiles/UnaryOpUGens_supernova.dir/UnaryOpUGens.cpp.o
> [ 21%] Linking CXX shared module UnaryOpUGens_supernova.so
> [ 21%] Built target UnaryOpUGens_supernova
> Scanning dependencies of target UnpackFFTUGens_supernova
> [ 21%] Building CXX object server/plugins/CMakeFiles/UnpackFFTUGens_supernova.dir/UnpackFFTUGens.cpp.o
> [ 21%] Linking CXX shared module UnpackFFTUGens_supernova.so
> [ 21%] Built target UnpackFFTUGens_supernova
> Scanning dependencies of target boost_system
> [ 21%] Building CXX object external_libraries/CMakeFiles/boost_system.dir/boost/libs/system/src/error_code.cpp.o
> [ 21%] Linking CXX static library libboost_system.a
> [ 21%] Built target boost_system
> Scanning dependencies of target libscsynth
> [ 21%] Building CXX object server/scsynth/CMakeFiles/libscsynth.dir/SC_BufGen.cpp.o
> [ 21%] Building CXX object server/scsynth/CMakeFiles/libscsynth.dir/SC_ComPort.cpp.o
> [ 21%] Building CXX object server/scsynth/CMakeFiles/libscsynth.dir/SC_CoreAudio.cpp.o
> [ 21%] Building CXX object server/scsynth/CMakeFiles/libscsynth.dir/SC_Graph.cpp.o
> [ 22%] Building CXX object server/scsynth/CMakeFiles/libscsynth.dir/SC_GraphDef.cpp.o
> [ 22%] Building CXX object server/scsynth/CMakeFiles/libscsynth.dir/SC_Group.cpp.o
> [ 22%] Building CXX object server/scsynth/CMakeFiles/libscsynth.dir/SC_Lib_Cintf.cpp.o
> [ 22%] Building CXX object server/scsynth/CMakeFiles/libscsynth.dir/SC_Lib.cpp.o
> [ 22%] Building CXX object server/scsynth/CMakeFiles/libscsynth.dir/SC_MiscCmds.cpp.o
> [ 22%] Building CXX object server/scsynth/CMakeFiles/libscsynth.dir/SC_Node.cpp.o
> [ 23%] Building CXX object server/scsynth/CMakeFiles/libscsynth.dir/SC_Rate.cpp.o
> [ 23%] Building CXX object server/scsynth/CMakeFiles/libscsynth.dir/SC_SequencedCommand.cpp.o
> [ 23%] Building CXX object server/scsynth/CMakeFiles/libscsynth.dir/SC_Str4.cpp.o
> [ 23%] Building CXX object server/scsynth/CMakeFiles/libscsynth.dir/SC_Unit.cpp.o
> [ 23%] Building CXX object server/scsynth/CMakeFiles/libscsynth.dir/SC_UnitDef.cpp.o
> [ 23%] Building CXX object server/scsynth/CMakeFiles/libscsynth.dir/SC_World.cpp.o
> [ 24%] Building CXX object server/scsynth/CMakeFiles/libscsynth.dir/Rendezvous.cpp.o
> [ 24%] Building CXX object server/scsynth/CMakeFiles/libscsynth.dir/__/__/common/SC_fftlib.cpp.o
> [ 24%] Building CXX object server/scsynth/CMakeFiles/libscsynth.dir/__/__/common/SC_AllocPool.cpp.o
> [ 24%] Building CXX object server/scsynth/CMakeFiles/libscsynth.dir/__/__/common/SC_DirUtils.cpp.o
> [ 24%] Building CXX object server/scsynth/CMakeFiles/libscsynth.dir/__/__/common/SC_Errors.cpp.o
> [ 24%] Building CXX object server/scsynth/CMakeFiles/libscsynth.dir/__/__/common/SC_Reply.cpp.o
> [ 25%] Building CXX object server/scsynth/CMakeFiles/libscsynth.dir/__/__/common/SC_StandAloneInfo_Darwin.cpp.o
> [ 25%] Building CXX object server/scsynth/CMakeFiles/libscsynth.dir/__/__/common/SC_StringBuffer.cpp.o
> [ 25%] Building CXX object server/scsynth/CMakeFiles/libscsynth.dir/__/__/common/SC_StringParser.cpp.o
> [ 25%] Building CXX object server/scsynth/CMakeFiles/libscsynth.dir/__/__/common/Samp.cpp.o
> [ 25%] Building CXX object server/scsynth/CMakeFiles/libscsynth.dir/__/__/common/sc_popen.cpp.o
> [ 25%] Building CXX object server/scsynth/CMakeFiles/libscsynth.dir/__/__/external_libraries/boost/libs/system/src/error_code.cpp.o
> [ 26%] Building CXX object server/scsynth/CMakeFiles/libscsynth.dir/SC_Jack.cpp.o
> [ 26%] Linking CXX static library libscsynth.a
> [ 26%] Built target libscsynth
> Scanning dependencies of target scsynth
> [ 26%] Building CXX object server/scsynth/CMakeFiles/scsynth.dir/scsynth_main.cpp.o
> [ 26%] Linking CXX executable scsynth
> [ 26%] Built target scsynth
> Scanning dependencies of target boost_thread
> [ 26%] Building CXX object external_libraries/CMakeFiles/boost_thread.dir/boost/libs/thread/src/future.cpp.o
> [ 27%] Building CXX object external_libraries/CMakeFiles/boost_thread.dir/boost/libs/thread/src/tss_null.cpp.o
> [ 27%] Building CXX object external_libraries/CMakeFiles/boost_thread.dir/boost/libs/thread/src/pthread/once_atomic.cpp.o
> [ 27%] Building CXX object external_libraries/CMakeFiles/boost_thread.dir/boost/libs/thread/src/pthread/once.cpp.o
> [ 27%] Building CXX object external_libraries/CMakeFiles/boost_thread.dir/boost/libs/thread/src/pthread/thread.cpp.o
> [ 27%] Linking CXX static library libboost_thread.a
> [ 27%] Built target boost_thread
> Scanning dependencies of target boost_filesystem
> [ 27%] Building CXX object external_libraries/CMakeFiles/boost_filesystem.dir/boost/libs/filesystem/src/unique_path.cpp.o
> [ 28%] Building CXX object external_libraries/CMakeFiles/boost_filesystem.dir/boost/libs/filesystem/src/operations.cpp.o
> [ 28%] Building CXX object external_libraries/CMakeFiles/boost_filesystem.dir/boost/libs/filesystem/src/windows_file_codecvt.cpp.o
> [ 28%] Building CXX object external_libraries/CMakeFiles/boost_filesystem.dir/boost/libs/filesystem/src/utf8_codecvt_facet.cpp.o
> [ 28%] Building CXX object external_libraries/CMakeFiles/boost_filesystem.dir/boost/libs/filesystem/src/portability.cpp.o
> [ 28%] Building CXX object external_libraries/CMakeFiles/boost_filesystem.dir/boost/libs/filesystem/src/path.cpp.o
> [ 28%] Building CXX object external_libraries/CMakeFiles/boost_filesystem.dir/boost/libs/filesystem/src/path_traits.cpp.o
> [ 28%] Building CXX object external_libraries/CMakeFiles/boost_filesystem.dir/boost/libs/filesystem/src/codecvt_error_category.cpp.o
> [ 29%] Linking CXX static library libboost_filesystem.a
> [ 29%] Built target boost_filesystem
> Scanning dependencies of target oscpack
> [ 29%] Building CXX object external_libraries/CMakeFiles/oscpack.dir/oscpack_build.cpp.o
> [ 29%] Linking CXX static library liboscpack.a
> [ 29%] Built target oscpack
> Scanning dependencies of target boost_program_options
> [ 29%] Building CXX object external_libraries/CMakeFiles/boost_program_options.dir/boost/libs/program_options/src/options_description.cpp.o
> [ 29%] Building CXX object external_libraries/CMakeFiles/boost_program_options.dir/boost/libs/program_options/src/value_semantic.cpp.o
> [ 29%] Building CXX object external_libraries/CMakeFiles/boost_program_options.dir/boost/libs/program_options/src/variables_map.cpp.o
> [ 29%] Building CXX object external_libraries/CMakeFiles/boost_program_options.dir/boost/libs/program_options/src/utf8_codecvt_facet.cpp.o
> [ 29%] Building CXX object external_libraries/CMakeFiles/boost_program_options.dir/boost/libs/program_options/src/positional_options.cpp.o
> [ 30%] Building CXX object external_libraries/CMakeFiles/boost_program_options.dir/boost/libs/program_options/src/parsers.cpp.o
> [ 30%] Building CXX object external_libraries/CMakeFiles/boost_program_options.dir/boost/libs/program_options/src/split.cpp.o
> [ 30%] Building CXX object external_libraries/CMakeFiles/boost_program_options.dir/boost/libs/program_options/src/convert.cpp.o
> [ 30%] Building CXX object external_libraries/CMakeFiles/boost_program_options.dir/boost/libs/program_options/src/winmain.cpp.o
> [ 30%] Building CXX object external_libraries/CMakeFiles/boost_program_options.dir/boost/libs/program_options/src/config_file.cpp.o
> [ 30%] Building CXX object external_libraries/CMakeFiles/boost_program_options.dir/boost/libs/program_options/src/cmdline.cpp.o
> [ 31%] Linking CXX static library libboost_program_options.a
> [ 31%] Built target boost_program_options
> Scanning dependencies of target libsupernova
> [ 31%] Building CXX object server/supernova/CMakeFiles/libsupernova.dir/sc/sc_synth_definition.cpp.o
> [ 31%] Building CXX object server/supernova/CMakeFiles/libsupernova.dir/sc/sc_osc_handler.cpp.o
> [ 31%] Building CXX object server/supernova/CMakeFiles/libsupernova.dir/sc/sc_plugin_interface.cpp.o
> [ 31%] Building CXX object server/supernova/CMakeFiles/libsupernova.dir/sc/sc_synth.cpp.o
> [ 31%] Building CXX object server/supernova/CMakeFiles/libsupernova.dir/sc/sc_synthdef.cpp.o
> [ 32%] Building CXX object server/supernova/CMakeFiles/libsupernova.dir/sc/sc_ugen_factory.cpp.o
> [ 32%] Building CXX object server/supernova/CMakeFiles/libsupernova.dir/__/__/common/Samp.cpp.o
> [ 32%] Building CXX object server/supernova/CMakeFiles/libsupernova.dir/__/__/common/SC_fftlib.cpp.o
> [ 32%] Building CXX object server/supernova/CMakeFiles/libsupernova.dir/__/__/common/SC_DirUtils.cpp.o
> [ 32%] Building CXX object server/supernova/CMakeFiles/libsupernova.dir/__/__/common/SC_StringParser.cpp.o
> [ 32%] Building CXX object server/supernova/CMakeFiles/libsupernova.dir/__/__/common/SC_StandAloneInfo_Darwin.cpp.o
> [ 33%] Building CXX object server/supernova/CMakeFiles/libsupernova.dir/server/buffer_manager.cpp.o
> [ 33%] Building CXX object server/supernova/CMakeFiles/libsupernova.dir/server/memory_pool.cpp.o
> [ 33%] Building CXX object server/supernova/CMakeFiles/libsupernova.dir/server/node_graph.cpp.o
> [ 33%] Building CXX object server/supernova/CMakeFiles/libsupernova.dir/server/server.cpp.o
> [ 33%] Building CXX object server/supernova/CMakeFiles/libsupernova.dir/server/server_args.cpp.o
> [ 33%] Linking CXX static library libsupernova.a
> [ 33%] Built target libsupernova
> Scanning dependencies of target supernova
> [ 33%] Building CXX object server/supernova/CMakeFiles/supernova.dir/server/main.cpp.o
> [ 34%] Linking CXX executable supernova
> [ 34%] Built target supernova
> [ 34%] Generating __/editors/sc-ide/primitives/moc_sc_ipc_client.cpp
> [ 35%] Generating __/QtCollider/moc_QcApplication.cpp
> [ 35%] Generating __/QtCollider/moc_QObjectProxy.cpp
> [ 35%] Generating __/QtCollider/moc_QWidgetProxy.cpp
> [ 35%] Generating __/QtCollider/moc_QtDownload.cpp
> [ 35%] Generating __/QtCollider/widgets/moc_BasicWidgets.cpp
> [ 35%] Generating __/QtCollider/widgets/moc_QcButton.cpp
> [ 36%] Generating __/QtCollider/widgets/moc_QcCheckBox.cpp
> [ 36%] Generating __/QtCollider/widgets/moc_QcTextField.cpp
> [ 36%] Generating __/QtCollider/widgets/moc_QcListWidget.cpp
> [ 36%] Generating __/QtCollider/widgets/moc_QcPopUpMenu.cpp
> [ 36%] Generating __/QtCollider/widgets/moc_QcTreeWidget.cpp
> [ 36%] Generating __/QtCollider/widgets/moc_QcScrollArea.cpp
> [ 37%] Generating __/QtCollider/widgets/moc_QcNumberBox.cpp
> [ 37%] Generating __/QtCollider/widgets/moc_QcSlider.cpp
> [ 37%] Generating __/QtCollider/widgets/moc_QcSlider2D.cpp
> [ 37%] Generating __/QtCollider/widgets/moc_QcRangeSlider.cpp
> [ 37%] Generating __/QtCollider/widgets/moc_QcMultiSlider.cpp
> [ 37%] Generating __/QtCollider/widgets/moc_QcKnob.cpp
> [ 38%] Generating __/QtCollider/widgets/moc_QcTextEdit.cpp
> [ 38%] Generating __/QtCollider/widgets/moc_QcScope.cpp
> [ 38%] Generating __/QtCollider/widgets/moc_QcScopeShm.cpp
> [ 38%] Generating __/QtCollider/widgets/moc_QcGraph.cpp
> [ 38%] Generating __/QtCollider/widgets/moc_QcLevelIndicator.cpp
> [ 38%] Generating __/QtCollider/widgets/moc_QcCanvas.cpp
> [ 38%] Generating __/QtCollider/widgets/soundfileview/moc_view.cpp
> [ 39%] Generating __/QtCollider/widgets/moc_QcFileDialog.cpp
> [ 39%] Generating __/QtCollider/widgets/moc_QcPenPrinter.cpp
> [ 39%] Generating __/QtCollider/widgets/moc_QcWebView.cpp
> [ 39%] Generating __/QtCollider/widgets/moc_web_page.cpp
> [ 39%] Generating __/QtCollider/widgets/moc_QcWindow.cpp
> [ 39%] Generating __/QtCollider/layouts/moc_layouts.cpp
> [ 40%] Generating __/QtCollider/layouts/moc_stack_layout.cpp
> [ 40%] Generating __/QtCollider/style/moc_style.cpp
> [ 40%] Generating __/QtCollider/moc_LanguageClient.cpp
> [ 40%] Generating qrc_resources.cpp
> Scanning dependencies of target libsclang
> [ 40%] Building CXX object lang/CMakeFiles/libsclang.dir/LangPrimSource/SC_HID_api.cpp.o
> [ 41%] Building CXX object lang/CMakeFiles/libsclang.dir/LangPrimSource/SC_Wii.cpp.o
> [ 41%] Building CXX object lang/CMakeFiles/libsclang.dir/LangPrimSource/PyrSignalPrim.cpp.o
> [ 41%] Building CXX object lang/CMakeFiles/libsclang.dir/LangPrimSource/PyrSched.cpp.o
> [ 41%] Building CXX object lang/CMakeFiles/libsclang.dir/LangPrimSource/PyrPrimitive.cpp.o
> [ 41%] Building CXX object lang/CMakeFiles/libsclang.dir/LangPrimSource/PyrMathPrim.cpp.o
> [ 41%] Building CXX object lang/CMakeFiles/libsclang.dir/LangPrimSource/SC_ComPort.cpp.o
> [ 42%] Building CXX object lang/CMakeFiles/libsclang.dir/LangPrimSource/OSCData.cpp.o
> [ 42%] Building CXX object lang/CMakeFiles/libsclang.dir/LangPrimSource/PyrArchiver.cpp.o
> [ 42%] Building CXX object lang/CMakeFiles/libsclang.dir/LangPrimSource/PyrArrayPrimitives.cpp.o
> [ 42%] Building CXX object lang/CMakeFiles/libsclang.dir/LangPrimSource/PyrBitPrim.cpp.o
> [ 42%] Building CXX object lang/CMakeFiles/libsclang.dir/LangPrimSource/PyrCharPrim.cpp.o
> [ 42%] Building CXX object lang/CMakeFiles/libsclang.dir/LangPrimSource/PyrFilePrim.cpp.o
> [ 42%] Building CXX object lang/CMakeFiles/libsclang.dir/LangPrimSource/PyrListPrim.cpp.o
> [ 43%] Building CXX object lang/CMakeFiles/libsclang.dir/LangPrimSource/PyrPlatformPrim.cpp.o
> [ 43%] Building CXX object lang/CMakeFiles/libsclang.dir/LangPrimSource/PyrStringPrim.cpp.o
> In file included from /home/ss/build/external_libraries/yaml-cpp-0.3.0/include/yaml-cpp/yaml.h:8:0,
>                  from /home/ss/build/lang/LangPrimSource/PyrStringPrim.cpp:47:
> /home/ss/build/external_libraries/yaml-cpp-0.3.0/include/yaml-cpp/parser.h:46:8: warning: ‘template<class> class std::auto_ptr’ is deprecated [-Wdeprecated-declarations]
>    std::auto_ptr<Scanner> m_pScanner;
>         ^
> In file included from /usr/include/c++/5/bits/locale_conv.h:41:0,
>                  from /usr/include/c++/5/locale:43,
>                  from /home/ss/build/external_libraries/boost/boost/algorithm/string/classification.hpp:15,
>                  from /home/ss/build/external_libraries/boost/boost/algorithm/string/trim.hpp:23,
>                  from /home/ss/build/external_libraries/boost/boost/algorithm/string.hpp:19,
>                  from /home/ss/build/common/SC_DirUtils.h:37,
>                  from /home/ss/build/lang/LangPrimSource/PyrStringPrim.cpp:34:
> /usr/include/c++/5/bits/unique_ptr.h:49:28: note: declared here
>    template<typename> class auto_ptr;
>                             ^
> In file included from /home/ss/build/external_libraries/yaml-cpp-0.3.0/include/yaml-cpp/yaml.h:8:0,
>                  from /home/ss/build/lang/LangPrimSource/PyrStringPrim.cpp:47:
> /home/ss/build/external_libraries/yaml-cpp-0.3.0/include/yaml-cpp/parser.h:47:8: warning: ‘template<class> class std::auto_ptr’ is deprecated [-Wdeprecated-declarations]
>    std::auto_ptr<Directives> m_pDirectives;
>         ^
> In file included from /usr/include/c++/5/bits/locale_conv.h:41:0,
>                  from /usr/include/c++/5/locale:43,
>                  from /home/ss/build/external_libraries/boost/boost/algorithm/string/classification.hpp:15,
>                  from /home/ss/build/external_libraries/boost/boost/algorithm/string/trim.hpp:23,
>                  from /home/ss/build/external_libraries/boost/boost/algorithm/string.hpp:19,
>                  from /home/ss/build/common/SC_DirUtils.h:37,
>                  from /home/ss/build/lang/LangPrimSource/PyrStringPrim.cpp:34:
> /usr/include/c++/5/bits/unique_ptr.h:49:28: note: declared here
>    template<typename> class auto_ptr;
>                             ^
> In file included from /home/ss/build/external_libraries/yaml-cpp-0.3.0/include/yaml-cpp/yaml.h:9:0,
>                  from /home/ss/build/lang/LangPrimSource/PyrStringPrim.cpp:47:
> /home/ss/build/external_libraries/yaml-cpp-0.3.0/include/yaml-cpp/emitter.h:105:8: warning: ‘template<class> class std::auto_ptr’ is deprecated [-Wdeprecated-declarations]
>    std::auto_ptr <EmitterState> m_pState;
>         ^
> In file included from /usr/include/c++/5/bits/locale_conv.h:41:0,
>                  from /usr/include/c++/5/locale:43,
>                  from /home/ss/build/external_libraries/boost/boost/algorithm/string/classification.hpp:15,
>                  from /home/ss/build/external_libraries/boost/boost/algorithm/string/trim.hpp:23,
>                  from /home/ss/build/external_libraries/boost/boost/algorithm/string.hpp:19,
>                  from /home/ss/build/common/SC_DirUtils.h:37,
>                  from /home/ss/build/lang/LangPrimSource/PyrStringPrim.cpp:34:
> /usr/include/c++/5/bits/unique_ptr.h:49:28: note: declared here
>    template<typename> class auto_ptr;
>                             ^
> In file included from /home/ss/build/external_libraries/yaml-cpp-0.3.0/include/yaml-cpp/node.h:14:0,
>                  from /home/ss/build/external_libraries/yaml-cpp-0.3.0/include/yaml-cpp/yaml.h:13,
>                  from /home/ss/build/lang/LangPrimSource/PyrStringPrim.cpp:47:
> /home/ss/build/external_libraries/yaml-cpp-0.3.0/include/yaml-cpp/iterator.h:20:17: warning: ‘template<class> class std::auto_ptr’ is deprecated [-Wdeprecated-declarations]
>    Iterator(std::auto_ptr<IterPriv> pData);
>                  ^
> In file included from /usr/include/c++/5/bits/locale_conv.h:41:0,
>                  from /usr/include/c++/5/locale:43,
>                  from /home/ss/build/external_libraries/boost/boost/algorithm/string/classification.hpp:15,
>                  from /home/ss/build/external_libraries/boost/boost/algorithm/string/trim.hpp:23,
>                  from /home/ss/build/external_libraries/boost/boost/algorithm/string.hpp:19,
>                  from /home/ss/build/common/SC_DirUtils.h:37,
>                  from /home/ss/build/lang/LangPrimSource/PyrStringPrim.cpp:34:
> /usr/include/c++/5/bits/unique_ptr.h:49:28: note: declared here
>    template<typename> class auto_ptr;
>                             ^
> In file included from /home/ss/build/external_libraries/yaml-cpp-0.3.0/include/yaml-cpp/node.h:14:0,
>                  from /home/ss/build/external_libraries/yaml-cpp-0.3.0/include/yaml-cpp/yaml.h:13,
>                  from /home/ss/build/lang/LangPrimSource/PyrStringPrim.cpp:47:
> /home/ss/build/external_libraries/yaml-cpp-0.3.0/include/yaml-cpp/iterator.h:36:8: warning: ‘template<class> class std::auto_ptr’ is deprecated [-Wdeprecated-declarations]
>    std::auto_ptr<IterPriv> m_pData;
>         ^
> In file included from /usr/include/c++/5/bits/locale_conv.h:41:0,
>                  from /usr/include/c++/5/locale:43,
>                  from /home/ss/build/external_libraries/boost/boost/algorithm/string/classification.hpp:15,
>                  from /home/ss/build/external_libraries/boost/boost/algorithm/string/trim.hpp:23,
>                  from /home/ss/build/external_libraries/boost/boost/algorithm/string.hpp:19,
>                  from /home/ss/build/common/SC_DirUtils.h:37,
>                  from /home/ss/build/lang/LangPrimSource/PyrStringPrim.cpp:34:
> /usr/include/c++/5/bits/unique_ptr.h:49:28: note: declared here
>    template<typename> class auto_ptr;
>                             ^
> In file included from /home/ss/build/external_libraries/yaml-cpp-0.3.0/include/yaml-cpp/yaml.h:13:0,
>                  from /home/ss/build/lang/LangPrimSource/PyrStringPrim.cpp:47:
> /home/ss/build/external_libraries/yaml-cpp-0.3.0/include/yaml-cpp/node.h:43:8: warning: ‘template<class> class std::auto_ptr’ is deprecated [-Wdeprecated-declarations]
>    std::auto_ptr<Node> Clone() const;
>         ^
> In file included from /usr/include/c++/5/bits/locale_conv.h:41:0,
>                  from /usr/include/c++/5/locale:43,
>                  from /home/ss/build/external_libraries/boost/boost/algorithm/string/classification.hpp:15,
>                  from /home/ss/build/external_libraries/boost/boost/algorithm/string/trim.hpp:23,
>                  from /home/ss/build/external_libraries/boost/boost/algorithm/string.hpp:19,
>                  from /home/ss/build/common/SC_DirUtils.h:37,
>                  from /home/ss/build/lang/LangPrimSource/PyrStringPrim.cpp:34:
> /usr/include/c++/5/bits/unique_ptr.h:49:28: note: declared here
>    template<typename> class auto_ptr;
>                             ^
> In file included from /home/ss/build/external_libraries/yaml-cpp-0.3.0/include/yaml-cpp/yaml.h:13:0,
>                  from /home/ss/build/lang/LangPrimSource/PyrStringPrim.cpp:47:
> /home/ss/build/external_libraries/yaml-cpp-0.3.0/include/yaml-cpp/node.h:117:8: warning: ‘template<class> class std::auto_ptr’ is deprecated [-Wdeprecated-declarations]
>    std::auto_ptr<NodeOwnership> m_pOwnership;
>         ^
> In file included from /usr/include/c++/5/bits/locale_conv.h:41:0,
>                  from /usr/include/c++/5/locale:43,
>                  from /home/ss/build/external_libraries/boost/boost/algorithm/string/classification.hpp:15,
>                  from /home/ss/build/external_libraries/boost/boost/algorithm/string/trim.hpp:23,
>                  from /home/ss/build/external_libraries/boost/boost/algorithm/string.hpp:19,
>                  from /home/ss/build/common/SC_DirUtils.h:37,
>                  from /home/ss/build/lang/LangPrimSource/PyrStringPrim.cpp:34:
> /usr/include/c++/5/bits/unique_ptr.h:49:28: note: declared here
>    template<typename> class auto_ptr;
>                             ^
> [ 43%] Building CXX object lang/CMakeFiles/libsclang.dir/LangPrimSource/PyrSymbolPrim.cpp.o
> [ 43%] Building CXX object lang/CMakeFiles/libsclang.dir/LangPrimSource/PyrUnixPrim.cpp.o
> [ 43%] Building CXX object lang/CMakeFiles/libsclang.dir/LangSource/AdvancingAllocPool.cpp.o
> [ 43%] Building CXX object lang/CMakeFiles/libsclang.dir/LangSource/ByteCodeArray.cpp.o
> [ 44%] Building CXX object lang/CMakeFiles/libsclang.dir/LangSource/DumpParseNode.cpp.o
> [ 44%] Building CXX object lang/CMakeFiles/libsclang.dir/LangSource/GC.cpp.o
> [ 44%] Building CXX object lang/CMakeFiles/libsclang.dir/LangSource/InitAlloc.cpp.o
> [ 44%] Building CXX object lang/CMakeFiles/libsclang.dir/LangSource/PyrInterpreter3.cpp.o
> [ 44%] Building CXX object lang/CMakeFiles/libsclang.dir/LangSource/PyrLexer.cpp.o
> [ 44%] Building CXX object lang/CMakeFiles/libsclang.dir/LangSource/PyrMathOps.cpp.o
> [ 45%] Building CXX object lang/CMakeFiles/libsclang.dir/LangSource/PyrMathSupport.cpp.o
> [ 45%] Building CXX object lang/CMakeFiles/libsclang.dir/LangSource/PyrMessage.cpp.o
> [ 45%] Building CXX object lang/CMakeFiles/libsclang.dir/LangSource/PyrObject.cpp.o
> [ 45%] Building CXX object lang/CMakeFiles/libsclang.dir/LangSource/PyrParseNode.cpp.o
> [ 45%] Building CXX object lang/CMakeFiles/libsclang.dir/LangSource/PyrSignal.cpp.o
> [ 45%] Building CXX object lang/CMakeFiles/libsclang.dir/LangSource/PyrSymbolTable.cpp.o
> [ 46%] Building CXX object lang/CMakeFiles/libsclang.dir/LangSource/SC_LanguageClient.cpp.o
> [ 46%] Building CXX object lang/CMakeFiles/libsclang.dir/LangSource/SC_LanguageConfig.cpp.o
> In file included from /home/ss/build/external_libraries/yaml-cpp-0.3.0/include/yaml-cpp/yaml.h:8:0,
>                  from /home/ss/build/lang/LangSource/SC_LanguageConfig.cpp:45:
> /home/ss/build/external_libraries/yaml-cpp-0.3.0/include/yaml-cpp/parser.h:46:8: warning: ‘template<class> class std::auto_ptr’ is deprecated [-Wdeprecated-declarations]
>    std::auto_ptr<Scanner> m_pScanner;
>         ^
> In file included from /usr/include/c++/5/bits/locale_conv.h:41:0,
>                  from /usr/include/c++/5/locale:43,
>                  from /home/ss/build/external_libraries/boost/boost/algorithm/string/classification.hpp:15,
>                  from /home/ss/build/external_libraries/boost/boost/algorithm/string/trim.hpp:23,
>                  from /home/ss/build/external_libraries/boost/boost/algorithm/string.hpp:19,
>                  from /home/ss/build/common/SC_DirUtils.h:37,
>                  from /home/ss/build/lang/LangSource/SC_LanguageConfig.cpp:26:
> /usr/include/c++/5/bits/unique_ptr.h:49:28: note: declared here
>    template<typename> class auto_ptr;
>                             ^
> In file included from /home/ss/build/external_libraries/yaml-cpp-0.3.0/include/yaml-cpp/yaml.h:8:0,
>                  from /home/ss/build/lang/LangSource/SC_LanguageConfig.cpp:45:
> /home/ss/build/external_libraries/yaml-cpp-0.3.0/include/yaml-cpp/parser.h:47:8: warning: ‘template<class> class std::auto_ptr’ is deprecated [-Wdeprecated-declarations]
>    std::auto_ptr<Directives> m_pDirectives;
>         ^
> In file included from /usr/include/c++/5/bits/locale_conv.h:41:0,
>                  from /usr/include/c++/5/locale:43,
>                  from /home/ss/build/external_libraries/boost/boost/algorithm/string/classification.hpp:15,
>                  from /home/ss/build/external_libraries/boost/boost/algorithm/string/trim.hpp:23,
>                  from /home/ss/build/external_libraries/boost/boost/algorithm/string.hpp:19,
>                  from /home/ss/build/common/SC_DirUtils.h:37,
>                  from /home/ss/build/lang/LangSource/SC_LanguageConfig.cpp:26:
> /usr/include/c++/5/bits/unique_ptr.h:49:28: note: declared here
>    template<typename> class auto_ptr;
>                             ^
> In file included from /home/ss/build/external_libraries/yaml-cpp-0.3.0/include/yaml-cpp/yaml.h:9:0,
>                  from /home/ss/build/lang/LangSource/SC_LanguageConfig.cpp:45:
> /home/ss/build/external_libraries/yaml-cpp-0.3.0/include/yaml-cpp/emitter.h:105:8: warning: ‘template<class> class std::auto_ptr’ is deprecated [-Wdeprecated-declarations]
>    std::auto_ptr <EmitterState> m_pState;
>         ^
> In file included from /usr/include/c++/5/bits/locale_conv.h:41:0,
>                  from /usr/include/c++/5/locale:43,
>                  from /home/ss/build/external_libraries/boost/boost/algorithm/string/classification.hpp:15,
>                  from /home/ss/build/external_libraries/boost/boost/algorithm/string/trim.hpp:23,
>                  from /home/ss/build/external_libraries/boost/boost/algorithm/string.hpp:19,
>                  from /home/ss/build/common/SC_DirUtils.h:37,
>                  from /home/ss/build/lang/LangSource/SC_LanguageConfig.cpp:26:
> /usr/include/c++/5/bits/unique_ptr.h:49:28: note: declared here
>    template<typename> class auto_ptr;
>                             ^
> In file included from /home/ss/build/external_libraries/yaml-cpp-0.3.0/include/yaml-cpp/node.h:14:0,
>                  from /home/ss/build/external_libraries/yaml-cpp-0.3.0/include/yaml-cpp/yaml.h:13,
>                  from /home/ss/build/lang/LangSource/SC_LanguageConfig.cpp:45:
> /home/ss/build/external_libraries/yaml-cpp-0.3.0/include/yaml-cpp/iterator.h:20:17: warning: ‘template<class> class std::auto_ptr’ is deprecated [-Wdeprecated-declarations]
>    Iterator(std::auto_ptr<IterPriv> pData);
>                  ^
> In file included from /usr/include/c++/5/bits/locale_conv.h:41:0,
>                  from /usr/include/c++/5/locale:43,
>                  from /home/ss/build/external_libraries/boost/boost/algorithm/string/classification.hpp:15,
>                  from /home/ss/build/external_libraries/boost/boost/algorithm/string/trim.hpp:23,
>                  from /home/ss/build/external_libraries/boost/boost/algorithm/string.hpp:19,
>                  from /home/ss/build/common/SC_DirUtils.h:37,
>                  from /home/ss/build/lang/LangSource/SC_LanguageConfig.cpp:26:
> /usr/include/c++/5/bits/unique_ptr.h:49:28: note: declared here
>    template<typename> class auto_ptr;
>                             ^
> In file included from /home/ss/build/external_libraries/yaml-cpp-0.3.0/include/yaml-cpp/node.h:14:0,
>                  from /home/ss/build/external_libraries/yaml-cpp-0.3.0/include/yaml-cpp/yaml.h:13,
>                  from /home/ss/build/lang/LangSource/SC_LanguageConfig.cpp:45:
> /home/ss/build/external_libraries/yaml-cpp-0.3.0/include/yaml-cpp/iterator.h:36:8: warning: ‘template<class> class std::auto_ptr’ is deprecated [-Wdeprecated-declarations]
>    std::auto_ptr<IterPriv> m_pData;
>         ^
> In file included from /usr/include/c++/5/bits/locale_conv.h:41:0,
>                  from /usr/include/c++/5/locale:43,
>                  from /home/ss/build/external_libraries/boost/boost/algorithm/string/classification.hpp:15,
>                  from /home/ss/build/external_libraries/boost/boost/algorithm/string/trim.hpp:23,
>                  from /home/ss/build/external_libraries/boost/boost/algorithm/string.hpp:19,
>                  from /home/ss/build/common/SC_DirUtils.h:37,
>                  from /home/ss/build/lang/LangSource/SC_LanguageConfig.cpp:26:
> /usr/include/c++/5/bits/unique_ptr.h:49:28: note: declared here
>    template<typename> class auto_ptr;
>                             ^
> In file included from /home/ss/build/external_libraries/yaml-cpp-0.3.0/include/yaml-cpp/yaml.h:13:0,
>                  from /home/ss/build/lang/LangSource/SC_LanguageConfig.cpp:45:
> /home/ss/build/external_libraries/yaml-cpp-0.3.0/include/yaml-cpp/node.h:43:8: warning: ‘template<class> class std::auto_ptr’ is deprecated [-Wdeprecated-declarations]
>    std::auto_ptr<Node> Clone() const;
>         ^
> In file included from /usr/include/c++/5/bits/locale_conv.h:41:0,
>                  from /usr/include/c++/5/locale:43,
>                  from /home/ss/build/external_libraries/boost/boost/algorithm/string/classification.hpp:15,
>                  from /home/ss/build/external_libraries/boost/boost/algorithm/string/trim.hpp:23,
>                  from /home/ss/build/external_libraries/boost/boost/algorithm/string.hpp:19,
>                  from /home/ss/build/common/SC_DirUtils.h:37,
>                  from /home/ss/build/lang/LangSource/SC_LanguageConfig.cpp:26:
> /usr/include/c++/5/bits/unique_ptr.h:49:28: note: declared here
>    template<typename> class auto_ptr;
>                             ^
> In file included from /home/ss/build/external_libraries/yaml-cpp-0.3.0/include/yaml-cpp/yaml.h:13:0,
>                  from /home/ss/build/lang/LangSource/SC_LanguageConfig.cpp:45:
> /home/ss/build/external_libraries/yaml-cpp-0.3.0/include/yaml-cpp/node.h:117:8: warning: ‘template<class> class std::auto_ptr’ is deprecated [-Wdeprecated-declarations]
>    std::auto_ptr<NodeOwnership> m_pOwnership;
>         ^
> In file included from /usr/include/c++/5/bits/locale_conv.h:41:0,
>                  from /usr/include/c++/5/locale:43,
>                  from /home/ss/build/external_libraries/boost/boost/algorithm/string/classification.hpp:15,
>                  from /home/ss/build/external_libraries/boost/boost/algorithm/string/trim.hpp:23,
>                  from /home/ss/build/external_libraries/boost/boost/algorithm/string.hpp:19,
>                  from /home/ss/build/common/SC_DirUtils.h:37,
>                  from /home/ss/build/lang/LangSource/SC_LanguageConfig.cpp:26:
> /usr/include/c++/5/bits/unique_ptr.h:49:28: note: declared here
>    template<typename> class auto_ptr;
>                             ^
> [ 46%] Building CXX object lang/CMakeFiles/libsclang.dir/LangSource/SC_TerminalClient.cpp.o
> [ 46%] Building CXX object lang/CMakeFiles/libsclang.dir/LangSource/SimpleStack.cpp.o
> [ 46%] Building CXX object lang/CMakeFiles/libsclang.dir/LangSource/VMGlobals.cpp.o
> [ 46%] Building CXX object lang/CMakeFiles/libsclang.dir/LangSource/dumpByteCodes.cpp.o
> [ 47%] Building C object lang/CMakeFiles/libsclang.dir/__/common/fftlib.c.o
> [ 47%] Building CXX object lang/CMakeFiles/libsclang.dir/__/common/Samp.cpp.o
> [ 47%] Building CXX object lang/CMakeFiles/libsclang.dir/__/common/SC_AllocPool.cpp.o
> [ 47%] Building CXX object lang/CMakeFiles/libsclang.dir/__/common/SC_DirUtils.cpp.o
> [ 47%] Building CXX object lang/CMakeFiles/libsclang.dir/__/common/SC_Reply.cpp.o
> [ 47%] Building CXX object lang/CMakeFiles/libsclang.dir/__/common/SC_StandAloneInfo_Darwin.cpp.o
> [ 47%] Building CXX object lang/CMakeFiles/libsclang.dir/__/common/SC_StringBuffer.cpp.o
> [ 48%] Building CXX object lang/CMakeFiles/libsclang.dir/__/common/SC_StringParser.cpp.o
> [ 48%] Building CXX object lang/CMakeFiles/libsclang.dir/__/common/SC_TextUtils.cpp.o
> [ 48%] Building CXX object lang/CMakeFiles/libsclang.dir/__/editors/sc-ide/primitives/localsocket_utils.cpp.o
> [ 48%] Building CXX object lang/CMakeFiles/libsclang.dir/__/common/sc_popen.cpp.o
> [ 48%] Building CXX object lang/CMakeFiles/libsclang.dir/__/external_libraries/boost/libs/filesystem/src/unique_path.cpp.o
> [ 48%] Building CXX object lang/CMakeFiles/libsclang.dir/__/external_libraries/boost/libs/filesystem/src/operations.cpp.o
> [ 49%] Building CXX object lang/CMakeFiles/libsclang.dir/__/external_libraries/boost/libs/filesystem/src/windows_file_codecvt.cpp.o
> [ 49%] Building CXX object lang/CMakeFiles/libsclang.dir/__/external_libraries/boost/libs/filesystem/src/utf8_codecvt_facet.cpp.o
> [ 49%] Building CXX object lang/CMakeFiles/libsclang.dir/__/external_libraries/boost/libs/filesystem/src/portability.cpp.o
> [ 49%] Building CXX object lang/CMakeFiles/libsclang.dir/__/external_libraries/boost/libs/filesystem/src/path.cpp.o
> [ 49%] Building CXX object lang/CMakeFiles/libsclang.dir/__/external_libraries/boost/libs/filesystem/src/path_traits.cpp.o
> [ 49%] Building CXX object lang/CMakeFiles/libsclang.dir/__/external_libraries/boost/libs/filesystem/src/codecvt_error_category.cpp.o
> [ 50%] Building CXX object lang/CMakeFiles/libsclang.dir/__/external_libraries/boost/libs/system/src/error_code.cpp.o
> [ 50%] Building CXX object lang/CMakeFiles/libsclang.dir/__/external_libraries/boost/libs/regex/src/regex_raw_buffer.cpp.o
> [ 50%] Building CXX object lang/CMakeFiles/libsclang.dir/__/external_libraries/boost/libs/regex/src/usinstances.cpp.o
> [ 50%] Building CXX object lang/CMakeFiles/libsclang.dir/__/external_libraries/boost/libs/regex/src/c_regex_traits.cpp.o
> [ 50%] Building CXX object lang/CMakeFiles/libsclang.dir/__/external_libraries/boost/libs/regex/src/instances.cpp.o
> [ 50%] Building CXX object lang/CMakeFiles/libsclang.dir/__/external_libraries/boost/libs/regex/src/icu.cpp.o
> [ 51%] Building CXX object lang/CMakeFiles/libsclang.dir/__/external_libraries/boost/libs/regex/src/regex_debug.cpp.o
> [ 51%] Building CXX object lang/CMakeFiles/libsclang.dir/__/external_libraries/boost/libs/regex/src/posix_api.cpp.o
> [ 51%] Building CXX object lang/CMakeFiles/libsclang.dir/__/external_libraries/boost/libs/regex/src/fileiter.cpp.o
> [ 51%] Building CXX object lang/CMakeFiles/libsclang.dir/__/external_libraries/boost/libs/regex/src/regex_traits_defaults.cpp.o
> [ 51%] Building CXX object lang/CMakeFiles/libsclang.dir/__/external_libraries/boost/libs/regex/src/wc_regex_traits.cpp.o
> [ 51%] Building CXX object lang/CMakeFiles/libsclang.dir/__/external_libraries/boost/libs/regex/src/regex.cpp.o
> [ 51%] Building CXX object lang/CMakeFiles/libsclang.dir/__/external_libraries/boost/libs/regex/src/cregex.cpp.o
> [ 52%] Building CXX object lang/CMakeFiles/libsclang.dir/__/external_libraries/boost/libs/regex/src/winstances.cpp.o
> [ 52%] Building CXX object lang/CMakeFiles/libsclang.dir/__/external_libraries/boost/libs/regex/src/cpp_regex_traits.cpp.o
> [ 52%] Building CXX object lang/CMakeFiles/libsclang.dir/__/external_libraries/boost/libs/regex/src/static_mutex.cpp.o
> [ 52%] Building CXX object lang/CMakeFiles/libsclang.dir/__/external_libraries/boost/libs/regex/src/w32_regex_traits.cpp.o
> [ 52%] Building CXX object lang/CMakeFiles/libsclang.dir/__/external_libraries/boost/libs/regex/src/wide_posix_api.cpp.o
> [ 52%] Building CXX object lang/CMakeFiles/libsclang.dir/LangPrimSource/PyrSerialPrim.cpp.o
> [ 53%] Building CXX object lang/CMakeFiles/libsclang.dir/LangPrimSource/SC_AlsaMIDI.cpp.o
> [ 53%] Building CXX object lang/CMakeFiles/libsclang.dir/LangPrimSource/SC_LID.cpp.o
> [ 53%] Building CXX object lang/CMakeFiles/libsclang.dir/__/QtCollider/type_codec.cpp.o
> [ 53%] Building CXX object lang/CMakeFiles/libsclang.dir/__/QtCollider/metatype.cpp.o
> [ 53%] Building CXX object lang/CMakeFiles/libsclang.dir/__/QtCollider/debug.cpp.o
> [ 53%] Building CXX object lang/CMakeFiles/libsclang.dir/__/QtCollider/interface.cpp.o
> [ 54%] Building CXX object lang/CMakeFiles/libsclang.dir/__/QtCollider/factories.cpp.o
> [ 54%] Building CXX object lang/CMakeFiles/libsclang.dir/__/QtCollider/QcApplication.cpp.o
> [ 54%] Building CXX object lang/CMakeFiles/libsclang.dir/__/QtCollider/Common.cpp.o
> [ 54%] Building CXX object lang/CMakeFiles/libsclang.dir/__/QtCollider/QObjectProxy.cpp.o
> [ 54%] Building CXX object lang/CMakeFiles/libsclang.dir/__/QtCollider/QWidgetProxy.cpp.o
> [ 54%] Building CXX object lang/CMakeFiles/libsclang.dir/__/QtCollider/QcObjectFactory.cpp.o
> [ 55%] Building CXX object lang/CMakeFiles/libsclang.dir/__/QtCollider/QtDownload.cpp.o
> [ 55%] Building CXX object lang/CMakeFiles/libsclang.dir/__/QtCollider/hacks/hacks_x11.cpp.o
> [ 55%] Building CXX object lang/CMakeFiles/libsclang.dir/__/QtCollider/primitives/primitives.cpp.o
> [ 55%] Building CXX object lang/CMakeFiles/libsclang.dir/__/QtCollider/primitives/prim_QObject.cpp.o
> [ 55%] Building CXX object lang/CMakeFiles/libsclang.dir/__/QtCollider/primitives/prim_QPen.cpp.o
> [ 55%] Building CXX object lang/CMakeFiles/libsclang.dir/__/QtCollider/primitives/prim_misc.cpp.o
> [ 55%] Building CXX object lang/CMakeFiles/libsclang.dir/__/QtCollider/primitives/prim_QWidget.cpp.o
> [ 56%] Building CXX object lang/CMakeFiles/libsclang.dir/__/QtCollider/primitives/prim_QPalette.cpp.o
> [ 56%] Building CXX object lang/CMakeFiles/libsclang.dir/__/QtCollider/primitives/prim_QImage.cpp.o
> [ 56%] Building CXX object lang/CMakeFiles/libsclang.dir/__/QtCollider/widgets/BasicWidgets.cpp.o
> [ 56%] Building CXX object lang/CMakeFiles/libsclang.dir/__/QtCollider/widgets/QcButton.cpp.o
> [ 56%] Building CXX object lang/CMakeFiles/libsclang.dir/__/QtCollider/widgets/QcListWidget.cpp.o
> [ 56%] Building CXX object lang/CMakeFiles/libsclang.dir/__/QtCollider/widgets/QcPopUpMenu.cpp.o
> [ 57%] Building CXX object lang/CMakeFiles/libsclang.dir/__/QtCollider/widgets/QcTreeWidget.cpp.o
> [ 57%] Building CXX object lang/CMakeFiles/libsclang.dir/__/QtCollider/widgets/QcScrollArea.cpp.o
> [ 57%] Building CXX object lang/CMakeFiles/libsclang.dir/__/QtCollider/widgets/QcAbstractStepValue.cpp.o
> [ 57%] Building CXX object lang/CMakeFiles/libsclang.dir/__/QtCollider/widgets/QcNumberBox.cpp.o
> [ 57%] Building CXX object lang/CMakeFiles/libsclang.dir/__/QtCollider/widgets/QcSlider.cpp.o
> [ 57%] Building CXX object lang/CMakeFiles/libsclang.dir/__/QtCollider/widgets/QcSlider2D.cpp.o
> [ 58%] Building CXX object lang/CMakeFiles/libsclang.dir/__/QtCollider/widgets/QcRangeSlider.cpp.o
> [ 58%] Building CXX object lang/CMakeFiles/libsclang.dir/__/QtCollider/widgets/QcMultiSlider.cpp.o
> [ 58%] Building CXX object lang/CMakeFiles/libsclang.dir/__/QtCollider/widgets/QcKnob.cpp.o
> [ 58%] Building CXX object lang/CMakeFiles/libsclang.dir/__/QtCollider/widgets/QcTextEdit.cpp.o
> [ 58%] Building CXX object lang/CMakeFiles/libsclang.dir/__/QtCollider/widgets/QcScope.cpp.o
> [ 58%] Building CXX object lang/CMakeFiles/libsclang.dir/__/QtCollider/widgets/QcScopeShm.cpp.o
> [ 59%] Building CXX object lang/CMakeFiles/libsclang.dir/__/QtCollider/widgets/QcLevelIndicator.cpp.o
> [ 59%] Building CXX object lang/CMakeFiles/libsclang.dir/__/QtCollider/widgets/QcWindow.cpp.o
> [ 59%] Building CXX object lang/CMakeFiles/libsclang.dir/__/QtCollider/widgets/QcGraph.cpp.o
> [ 59%] Building CXX object lang/CMakeFiles/libsclang.dir/__/QtCollider/widgets/QcCanvas.cpp.o
> [ 59%] Building CXX object lang/CMakeFiles/libsclang.dir/__/QtCollider/widgets/soundfileview/view.cpp.o
> [ 59%] Building CXX object lang/CMakeFiles/libsclang.dir/__/QtCollider/widgets/soundfileview/filestream.cpp.o
> [ 60%] Building CXX object lang/CMakeFiles/libsclang.dir/__/QtCollider/widgets/soundfileview/cachestream.cpp.o
> [ 60%] Building CXX object lang/CMakeFiles/libsclang.dir/__/QtCollider/widgets/QcFileDialog.cpp.o
> [ 60%] Building CXX object lang/CMakeFiles/libsclang.dir/__/QtCollider/widgets/QcPenPrinter.cpp.o
> [ 60%] Building CXX object lang/CMakeFiles/libsclang.dir/__/QtCollider/widgets/QcWebView.cpp.o
> [ 60%] Building CXX object lang/CMakeFiles/libsclang.dir/__/QtCollider/widgets/web_page.cpp.o
> [ 60%] Building CXX object lang/CMakeFiles/libsclang.dir/__/QtCollider/layouts/layouts.cpp.o
> [ 60%] Building CXX object lang/CMakeFiles/libsclang.dir/__/QtCollider/layouts/stack_layout.cpp.o
> [ 61%] Building CXX object lang/CMakeFiles/libsclang.dir/__/QtCollider/style/ProxyStyle.cpp.o
> [ 61%] Building CXX object lang/CMakeFiles/libsclang.dir/__/QtCollider/style/style.cpp.o
> [ 61%] Building CXX object lang/CMakeFiles/libsclang.dir/__/QtCollider/LanguageClient.cpp.o
> [ 61%] Building CXX object lang/CMakeFiles/libsclang.dir/__/QtCollider/moc_QcApplication.cpp.o
> [ 61%] Building CXX object lang/CMakeFiles/libsclang.dir/__/QtCollider/moc_QObjectProxy.cpp.o
> [ 61%] Building CXX object lang/CMakeFiles/libsclang.dir/__/QtCollider/moc_QWidgetProxy.cpp.o
> [ 62%] Building CXX object lang/CMakeFiles/libsclang.dir/__/QtCollider/moc_QtDownload.cpp.o
> [ 62%] Building CXX object lang/CMakeFiles/libsclang.dir/__/QtCollider/widgets/moc_BasicWidgets.cpp.o
> [ 62%] Building CXX object lang/CMakeFiles/libsclang.dir/__/QtCollider/widgets/moc_QcButton.cpp.o
> [ 62%] Building CXX object lang/CMakeFiles/libsclang.dir/__/QtCollider/widgets/moc_QcCheckBox.cpp.o
> [ 62%] Building CXX object lang/CMakeFiles/libsclang.dir/__/QtCollider/widgets/moc_QcTextField.cpp.o
> [ 62%] Building CXX object lang/CMakeFiles/libsclang.dir/__/QtCollider/widgets/moc_QcListWidget.cpp.o
> [ 63%] Building CXX object lang/CMakeFiles/libsclang.dir/__/QtCollider/widgets/moc_QcPopUpMenu.cpp.o
> [ 63%] Building CXX object lang/CMakeFiles/libsclang.dir/__/QtCollider/widgets/moc_QcTreeWidget.cpp.o
> [ 63%] Building CXX object lang/CMakeFiles/libsclang.dir/__/QtCollider/widgets/moc_QcScrollArea.cpp.o
> [ 63%] Building CXX object lang/CMakeFiles/libsclang.dir/__/QtCollider/widgets/moc_QcNumberBox.cpp.o
> [ 63%] Building CXX object lang/CMakeFiles/libsclang.dir/__/QtCollider/widgets/moc_QcSlider.cpp.o
> [ 63%] Building CXX object lang/CMakeFiles/libsclang.dir/__/QtCollider/widgets/moc_QcSlider2D.cpp.o
> [ 64%] Building CXX object lang/CMakeFiles/libsclang.dir/__/QtCollider/widgets/moc_QcRangeSlider.cpp.o
> [ 64%] Building CXX object lang/CMakeFiles/libsclang.dir/__/QtCollider/widgets/moc_QcMultiSlider.cpp.o
> [ 64%] Building CXX object lang/CMakeFiles/libsclang.dir/__/QtCollider/widgets/moc_QcKnob.cpp.o
> [ 64%] Building CXX object lang/CMakeFiles/libsclang.dir/__/QtCollider/widgets/moc_QcTextEdit.cpp.o
> [ 64%] Building CXX object lang/CMakeFiles/libsclang.dir/__/QtCollider/widgets/moc_QcScope.cpp.o
> [ 64%] Building CXX object lang/CMakeFiles/libsclang.dir/__/QtCollider/widgets/moc_QcScopeShm.cpp.o
> [ 64%] Building CXX object lang/CMakeFiles/libsclang.dir/__/QtCollider/widgets/moc_QcGraph.cpp.o
> [ 65%] Building CXX object lang/CMakeFiles/libsclang.dir/__/QtCollider/widgets/moc_QcLevelIndicator.cpp.o
> [ 65%] Building CXX object lang/CMakeFiles/libsclang.dir/__/QtCollider/widgets/moc_QcCanvas.cpp.o
> [ 65%] Building CXX object lang/CMakeFiles/libsclang.dir/__/QtCollider/widgets/soundfileview/moc_view.cpp.o
> [ 65%] Building CXX object lang/CMakeFiles/libsclang.dir/__/QtCollider/widgets/moc_QcFileDialog.cpp.o
> [ 65%] Building CXX object lang/CMakeFiles/libsclang.dir/__/QtCollider/widgets/moc_QcPenPrinter.cpp.o
> [ 65%] Building CXX object lang/CMakeFiles/libsclang.dir/__/QtCollider/widgets/moc_QcWebView.cpp.o
> [ 66%] Building CXX object lang/CMakeFiles/libsclang.dir/__/QtCollider/widgets/moc_web_page.cpp.o
> [ 66%] Building CXX object lang/CMakeFiles/libsclang.dir/__/QtCollider/widgets/moc_QcWindow.cpp.o
> [ 66%] Building CXX object lang/CMakeFiles/libsclang.dir/__/QtCollider/layouts/moc_layouts.cpp.o
> [ 66%] Building CXX object lang/CMakeFiles/libsclang.dir/__/QtCollider/layouts/moc_stack_layout.cpp.o
> [ 66%] Building CXX object lang/CMakeFiles/libsclang.dir/__/QtCollider/style/moc_style.cpp.o
> [ 66%] Building CXX object lang/CMakeFiles/libsclang.dir/__/QtCollider/moc_LanguageClient.cpp.o
> [ 67%] Building CXX object lang/CMakeFiles/libsclang.dir/qrc_resources.cpp.o
> [ 67%] Building CXX object lang/CMakeFiles/libsclang.dir/__/editors/sc-ide/primitives/sc_ipc_client.cpp.o
> In file included from /home/ss/build/editors/sc-ide/primitives/sc_ipc_client.cpp:28:0:
> /home/ss/build/external_libraries/yaml-cpp-0.3.0/include/yaml-cpp/emitter.h:105:8: warning: ‘template<class> class std::auto_ptr’ is deprecated [-Wdeprecated-declarations]
>    std::auto_ptr <EmitterState> m_pState;
>         ^
> In file included from /usr/include/c++/5/memory:81:0,
>                  from /home/ss/build/external_libraries/yaml-cpp-0.3.0/include/yaml-cpp/emitter.h:15,
>                  from /home/ss/build/editors/sc-ide/primitives/sc_ipc_client.cpp:28:
> /usr/include/c++/5/bits/unique_ptr.h:49:28: note: declared here
>    template<typename> class auto_ptr;
>                             ^
> In file included from /home/ss/build/external_libraries/yaml-cpp-0.3.0/include/yaml-cpp/node.h:14:0,
>                  from /home/ss/build/editors/sc-ide/primitives/sc_ipc_client.cpp:29:
> /home/ss/build/external_libraries/yaml-cpp-0.3.0/include/yaml-cpp/iterator.h:20:17: warning: ‘template<class> class std::auto_ptr’ is deprecated [-Wdeprecated-declarations]
>    Iterator(std::auto_ptr<IterPriv> pData);
>                  ^
> In file included from /usr/include/c++/5/memory:81:0,
>                  from /home/ss/build/external_libraries/yaml-cpp-0.3.0/include/yaml-cpp/emitter.h:15,
>                  from /home/ss/build/editors/sc-ide/primitives/sc_ipc_client.cpp:28:
> /usr/include/c++/5/bits/unique_ptr.h:49:28: note: declared here
>    template<typename> class auto_ptr;
>                             ^
> In file included from /home/ss/build/external_libraries/yaml-cpp-0.3.0/include/yaml-cpp/node.h:14:0,
>                  from /home/ss/build/editors/sc-ide/primitives/sc_ipc_client.cpp:29:
> /home/ss/build/external_libraries/yaml-cpp-0.3.0/include/yaml-cpp/iterator.h:36:8: warning: ‘template<class> class std::auto_ptr’ is deprecated [-Wdeprecated-declarations]
>    std::auto_ptr<IterPriv> m_pData;
>         ^
> In file included from /usr/include/c++/5/memory:81:0,
>                  from /home/ss/build/external_libraries/yaml-cpp-0.3.0/include/yaml-cpp/emitter.h:15,
>                  from /home/ss/build/editors/sc-ide/primitives/sc_ipc_client.cpp:28:
> /usr/include/c++/5/bits/unique_ptr.h:49:28: note: declared here
>    template<typename> class auto_ptr;
>                             ^
> In file included from /home/ss/build/editors/sc-ide/primitives/sc_ipc_client.cpp:29:0:
> /home/ss/build/external_libraries/yaml-cpp-0.3.0/include/yaml-cpp/node.h:43:8: warning: ‘template<class> class std::auto_ptr’ is deprecated [-Wdeprecated-declarations]
>    std::auto_ptr<Node> Clone() const;
>         ^
> In file included from /usr/include/c++/5/memory:81:0,
>                  from /home/ss/build/external_libraries/yaml-cpp-0.3.0/include/yaml-cpp/emitter.h:15,
>                  from /home/ss/build/editors/sc-ide/primitives/sc_ipc_client.cpp:28:
> /usr/include/c++/5/bits/unique_ptr.h:49:28: note: declared here
>    template<typename> class auto_ptr;
>                             ^
> In file included from /home/ss/build/editors/sc-ide/primitives/sc_ipc_client.cpp:29:0:
> /home/ss/build/external_libraries/yaml-cpp-0.3.0/include/yaml-cpp/node.h:117:8: warning: ‘template<class> class std::auto_ptr’ is deprecated [-Wdeprecated-declarations]
>    std::auto_ptr<NodeOwnership> m_pOwnership;
>         ^
> In file included from /usr/include/c++/5/memory:81:0,
>                  from /home/ss/build/external_libraries/yaml-cpp-0.3.0/include/yaml-cpp/emitter.h:15,
>                  from /home/ss/build/editors/sc-ide/primitives/sc_ipc_client.cpp:28:
> /usr/include/c++/5/bits/unique_ptr.h:49:28: note: declared here
>    template<typename> class auto_ptr;
>                             ^
> In file included from /home/ss/build/editors/sc-ide/primitives/sc_ipc_client.cpp:30:0:
> /home/ss/build/external_libraries/yaml-cpp-0.3.0/include/yaml-cpp/parser.h:46:8: warning: ‘template<class> class std::auto_ptr’ is deprecated [-Wdeprecated-declarations]
>    std::auto_ptr<Scanner> m_pScanner;
>         ^
> In file included from /usr/include/c++/5/memory:81:0,
>                  from /home/ss/build/external_libraries/yaml-cpp-0.3.0/include/yaml-cpp/emitter.h:15,
>                  from /home/ss/build/editors/sc-ide/primitives/sc_ipc_client.cpp:28:
> /usr/include/c++/5/bits/unique_ptr.h:49:28: note: declared here
>    template<typename> class auto_ptr;
>                             ^
> In file included from /home/ss/build/editors/sc-ide/primitives/sc_ipc_client.cpp:30:0:
> /home/ss/build/external_libraries/yaml-cpp-0.3.0/include/yaml-cpp/parser.h:47:8: warning: ‘template<class> class std::auto_ptr’ is deprecated [-Wdeprecated-declarations]
>    std::auto_ptr<Directives> m_pDirectives;
>         ^
> In file included from /usr/include/c++/5/memory:81:0,
>                  from /home/ss/build/external_libraries/yaml-cpp-0.3.0/include/yaml-cpp/emitter.h:15,
>                  from /home/ss/build/editors/sc-ide/primitives/sc_ipc_client.cpp:28:
> /usr/include/c++/5/bits/unique_ptr.h:49:28: note: declared here
>    template<typename> class auto_ptr;
>                             ^
> [ 67%] Building CXX object lang/CMakeFiles/libsclang.dir/__/editors/sc-ide/primitives/moc_sc_ipc_client.cpp.o
> [ 67%] Building CXX object lang/CMakeFiles/libsclang.dir/__/SCDoc/SCDoc.cpp.o
> [ 67%] Building CXX object lang/CMakeFiles/libsclang.dir/__/SCDoc/SCDoc.tab.cpp.o
> [ 67%] Building CXX object lang/CMakeFiles/libsclang.dir/__/SCDoc/lex.scdoc.cpp.o
> [ 68%] Building CXX object lang/CMakeFiles/libsclang.dir/__/SCDoc/SCDocPrim.cpp.o
> [ 68%] Building CXX object lang/CMakeFiles/libsclang.dir/LangSource/Bison/lang11d_tab.cpp.o
> [ 68%] Linking CXX static library libsclang.a
> [ 68%] Built target libsclang
> Scanning dependencies of target sclang
> [ 69%] Building CXX object lang/CMakeFiles/sclang.dir/LangSource/cmdLineFuncs.cpp.o
> [ 69%] Linking CXX executable sclang
> /usr/bin/ld: warning: libgstreamer-0.10.so.0, needed by /home/ss/Qt/5.3/gcc_64/lib/libQt5WebKit.so.5.3.2, not found (try using -rpath or -rpath-link)
> /usr/bin/ld: warning: libgstapp-0.10.so.0, needed by /home/ss/Qt/5.3/gcc_64/lib/libQt5WebKit.so.5.3.2, not found (try using -rpath or -rpath-link)
> /usr/bin/ld: warning: libgstbase-0.10.so.0, needed by /home/ss/Qt/5.3/gcc_64/lib/libQt5WebKit.so.5.3.2, not found (try using -rpath or -rpath-link)
> /usr/bin/ld: warning: libgstinterfaces-0.10.so.0, needed by /home/ss/Qt/5.3/gcc_64/lib/libQt5WebKit.so.5.3.2, not found (try using -rpath or -rpath-link)
> /usr/bin/ld: warning: libgstpbutils-0.10.so.0, needed by /home/ss/Qt/5.3/gcc_64/lib/libQt5WebKit.so.5.3.2, not found (try using -rpath or -rpath-link)
> /usr/bin/ld: warning: libgstvideo-0.10.so.0, needed by /home/ss/Qt/5.3/gcc_64/lib/libQt5WebKit.so.5.3.2, not found (try using -rpath or -rpath-link)
> /home/ss/Qt/5.3/gcc_64/lib/libQt5WebKit.so.5.3.2: undefined reference to `gst_element_add_pad'
> /home/ss/Qt/5.3/gcc_64/lib/libQt5WebKit.so.5.3.2: undefined reference to `gst_object_ref'
> /home/ss/Qt/5.3/gcc_64/lib/libQt5WebKit.so.5.3.2: undefined reference to `gst_app_src_push_buffer'
> /home/ss/Qt/5.3/gcc_64/lib/libQt5WebKit.so.5.3.2: undefined reference to `gst_element_query'
> /home/ss/Qt/5.3/gcc_64/lib/libQt5WebKit.so.5.3.2: undefined reference to `gst_caps_get_type'
> /home/ss/Qt/5.3/gcc_64/lib/libQt5WebKit.so.5.3.2: undefined reference to `gst_query_new_buffering'
> /home/ss/Qt/5.3/gcc_64/lib/libQt5WebKit.so.5.3.2: undefined reference to `gst_element_query_position'
> /home/ss/Qt/5.3/gcc_64/lib/libQt5WebKit.so.5.3.2: undefined reference to `gst_pad_get_parent_element'
> /home/ss/Qt/5.3/gcc_64/lib/libQt5WebKit.so.5.3.2: undefined reference to `gst_tag_list_add'
> /home/ss/Qt/5.3/gcc_64/lib/libQt5WebKit.so.5.3.2: undefined reference to `gst_iterator_resync'
> /home/ss/Qt/5.3/gcc_64/lib/libQt5WebKit.so.5.3.2: undefined reference to `gst_pad_unlink'
> /home/ss/Qt/5.3/gcc_64/lib/libQt5WebKit.so.5.3.2: undefined reference to `gst_message_parse_request_state'
> /home/ss/Qt/5.3/gcc_64/lib/libQt5WebKit.so.5.3.2: undefined reference to `gst_query_new_segment'
> /home/ss/Qt/5.3/gcc_64/lib/libQt5WebKit.so.5.3.2: undefined reference to `gst_mini_object_unref'
> /home/ss/Qt/5.3/gcc_64/lib/libQt5WebKit.so.5.3.2: undefined reference to `gst_structure_get_int'
> /home/ss/Qt/5.3/gcc_64/lib/libQt5WebKit.so.5.3.2: undefined reference to `_gst_debug_bin_to_dot_file_with_ts'
> /home/ss/Qt/5.3/gcc_64/lib/libQt5WebKit.so.5.3.2: undefined reference to `gst_element_factory_find'
> /home/ss/Qt/5.3/gcc_64/lib/libQt5WebKit.so.5.3.2: undefined reference to `gst_element_class_add_pad_template'
> /home/ss/Qt/5.3/gcc_64/lib/libQt5WebKit.so.5.3.2: undefined reference to `gst_segment_set_duration'
> /home/ss/Qt/5.3/gcc_64/lib/libQt5WebKit.so.5.3.2: undefined reference to `gst_pad_link'
> /home/ss/Qt/5.3/gcc_64/lib/libQt5WebKit.so.5.3.2: undefined reference to `gst_uri_handler_get_type'
> /home/ss/Qt/5.3/gcc_64/lib/libQt5WebKit.so.5.3.2: undefined reference to `gst_bin_remove_many'
> /home/ss/Qt/5.3/gcc_64/lib/libQt5WebKit.so.5.3.2: undefined reference to `gst_bin_add_many'
> /home/ss/Qt/5.3/gcc_64/lib/libQt5WebKit.so.5.3.2: undefined reference to `gst_bin_get_by_name'
> /home/ss/Qt/5.3/gcc_64/lib/libQt5WebKit.so.5.3.2: undefined reference to `gst_x_overlay_set_window_handle'
> /home/ss/Qt/5.3/gcc_64/lib/libQt5WebKit.so.5.3.2: undefined reference to `gst_message_get_structure'
> /home/ss/Qt/5.3/gcc_64/lib/libQt5WebKit.so.5.3.2: undefined reference to `gst_element_seek'
> /home/ss/Qt/5.3/gcc_64/lib/libQt5WebKit.so.5.3.2: undefined reference to `gst_iterator_free'
> /home/ss/Qt/5.3/gcc_64/lib/libQt5WebKit.so.5.3.2: undefined reference to `gst_static_pad_template_get'
> /home/ss/Qt/5.3/gcc_64/lib/libQt5WebKit.so.5.3.2: undefined reference to `gst_query_parse_nth_buffering_range'
> /home/ss/Qt/5.3/gcc_64/lib/libQt5WebKit.so.5.3.2: undefined reference to `gst_element_message_full'
> /home/ss/Qt/5.3/gcc_64/lib/libQt5WebKit.so.5.3.2: undefined reference to `gst_element_link_many'
> /home/ss/Qt/5.3/gcc_64/lib/libQt5WebKit.so.5.3.2: undefined reference to `gst_plugin_feature_check_version'
> /home/ss/Qt/5.3/gcc_64/lib/libQt5WebKit.so.5.3.2: undefined reference to `gst_pipeline_get_type'
> /home/ss/Qt/5.3/gcc_64/lib/libQt5WebKit.so.5.3.2: undefined reference to `gst_x_overlay_get_type'
> /home/ss/Qt/5.3/gcc_64/lib/libQt5WebKit.so.5.3.2: undefined reference to `gst_app_src_set_emit_signals'
> /home/ss/Qt/5.3/gcc_64/lib/libQt5WebKit.so.5.3.2: undefined reference to `gst_uri_is_valid'
> /home/ss/Qt/5.3/gcc_64/lib/libQt5WebKit.so.5.3.2: undefined reference to `gst_element_factory_make'
> /home/ss/Qt/5.3/gcc_64/lib/libQt5WebKit.so.5.3.2: undefined reference to `gst_element_iterate_src_pads'
> /home/ss/Qt/5.3/gcc_64/lib/libQt5WebKit.so.5.3.2: undefined reference to `gst_value_list_get_size'
> /home/ss/Qt/5.3/gcc_64/lib/libQt5WebKit.so.5.3.2: undefined reference to `gst_buffer_copy_metadata'
> /home/ss/Qt/5.3/gcc_64/lib/libQt5WebKit.so.5.3.2: undefined reference to `gst_element_post_message'
> /home/ss/Qt/5.3/gcc_64/lib/libQt5WebKit.so.5.3.2: undefined reference to `gst_query_parse_buffering_range'
> /home/ss/Qt/5.3/gcc_64/lib/libQt5WebKit.so.5.3.2: undefined reference to `gst_element_query_duration'
> /home/ss/Qt/5.3/gcc_64/lib/libQt5WebKit.so.5.3.2: undefined reference to `gst_pipeline_get_bus'
> /home/ss/Qt/5.3/gcc_64/lib/libQt5WebKit.so.5.3.2: undefined reference to `gst_pad_set_blocked'
> /home/ss/Qt/5.3/gcc_64/lib/libQt5WebKit.so.5.3.2: undefined reference to `gst_message_new_request_state'
> /home/ss/Qt/5.3/gcc_64/lib/libQt5WebKit.so.5.3.2: undefined reference to `gst_stream_error_quark'
> /home/ss/Qt/5.3/gcc_64/lib/libQt5WebKit.so.5.3.2: undefined reference to `gst_implements_interface_cast'
> /home/ss/Qt/5.3/gcc_64/lib/libQt5WebKit.so.5.3.2: undefined reference to `gst_query_set_duration'
> /home/ss/Qt/5.3/gcc_64/lib/libQt5WebKit.so.5.3.2: undefined reference to `gst_value_get_structure'
> /home/ss/Qt/5.3/gcc_64/lib/libQt5WebKit.so.5.3.2: undefined reference to `gst_buffer_new_and_alloc'
> /home/ss/Qt/5.3/gcc_64/lib/libQt5WebKit.so.5.3.2: undefined reference to `gst_mini_object_replace'
> /home/ss/Qt/5.3/gcc_64/lib/libQt5WebKit.so.5.3.2: undefined reference to `gst_query_new_position'
> /home/ss/Qt/5.3/gcc_64/lib/libQt5WebKit.so.5.3.2: undefined reference to `gst_event_new_new_segment'
> /home/ss/Qt/5.3/gcc_64/lib/libQt5WebKit.so.5.3.2: undefined reference to `gst_bin_add'
> /home/ss/Qt/5.3/gcc_64/lib/libQt5WebKit.so.5.3.2: undefined reference to `gst_element_link_pads_full'
> /home/ss/Qt/5.3/gcc_64/lib/libQt5WebKit.so.5.3.2: undefined reference to `gst_structure_free'
> /home/ss/Qt/5.3/gcc_64/lib/libQt5WebKit.so.5.3.2: undefined reference to `gst_app_src_set_caps'
> /home/ss/Qt/5.3/gcc_64/lib/libQt5WebKit.so.5.3.2: undefined reference to `gst_tag_list_free'
> /home/ss/Qt/5.3/gcc_64/lib/libQt5WebKit.so.5.3.2: undefined reference to `gst_buffer_set_caps'
> /home/ss/Qt/5.3/gcc_64/lib/libQt5WebKit.so.5.3.2: undefined reference to `gst_app_src_set_max_bytes'
> /home/ss/Qt/5.3/gcc_64/lib/libQt5WebKit.so.5.3.2: undefined reference to `gst_mini_object_ref'
> /home/ss/Qt/5.3/gcc_64/lib/libQt5WebKit.so.5.3.2: undefined reference to `gst_element_get_static_pad'
> /home/ss/Qt/5.3/gcc_64/lib/libQt5WebKit.so.5.3.2: undefined reference to `gst_app_src_set_callbacks'
> /home/ss/Qt/5.3/gcc_64/lib/libQt5WebKit.so.5.3.2: undefined reference to `gst_object_get_name'
> /home/ss/Qt/5.3/gcc_64/lib/libQt5WebKit.so.5.3.2: undefined reference to `gst_ghost_pad_new_no_target_from_template'
> /home/ss/Qt/5.3/gcc_64/lib/libQt5WebKit.so.5.3.2: undefined reference to `gst_app_src_set_size'
> /home/ss/Qt/5.3/gcc_64/lib/libQt5WebKit.so.5.3.2: undefined reference to `gst_query_get_n_buffering_ranges'
> /home/ss/Qt/5.3/gcc_64/lib/libQt5WebKit.so.5.3.2: undefined reference to `gst_element_class_set_details_simple'
> /home/ss/Qt/5.3/gcc_64/lib/libQt5WebKit.so.5.3.2: undefined reference to `gst_message_parse_error'
> /home/ss/Qt/5.3/gcc_64/lib/libQt5WebKit.so.5.3.2: undefined reference to `gst_buffer_get_type'
> /home/ss/Qt/5.3/gcc_64/lib/libQt5WebKit.so.5.3.2: undefined reference to `gst_missing_plugin_message_get_installer_detail'
> /home/ss/Qt/5.3/gcc_64/lib/libQt5WebKit.so.5.3.2: undefined reference to `gst_install_plugins_async'
> /home/ss/Qt/5.3/gcc_64/lib/libQt5WebKit.so.5.3.2: undefined reference to `gst_bus_set_sync_handler'
> /home/ss/Qt/5.3/gcc_64/lib/libQt5WebKit.so.5.3.2: undefined reference to `gst_implements_interface_check'
> /home/ss/Qt/5.3/gcc_64/lib/libQt5WebKit.so.5.3.2: undefined reference to `gst_app_src_get_type'
> /home/ss/Qt/5.3/gcc_64/lib/libQt5WebKit.so.5.3.2: undefined reference to `gst_core_error_quark'
> /home/ss/Qt/5.3/gcc_64/lib/libQt5WebKit.so.5.3.2: undefined reference to `gst_ghost_pad_new_from_template'
> /home/ss/Qt/5.3/gcc_64/lib/libQt5WebKit.so.5.3.2: undefined reference to `gst_query_parse_segment'
> /home/ss/Qt/5.3/gcc_64/lib/libQt5WebKit.so.5.3.2: undefined reference to `gst_element_get_request_pad'
> /home/ss/Qt/5.3/gcc_64/lib/libQt5WebKit.so.5.3.2: undefined reference to `gst_bin_get_type'
> /home/ss/Qt/5.3/gcc_64/lib/libQt5WebKit.so.5.3.2: undefined reference to `gst_structure_get_string'
> /home/ss/Qt/5.3/gcc_64/lib/libQt5WebKit.so.5.3.2: undefined reference to `gst_message_parse_state_changed'
> /home/ss/Qt/5.3/gcc_64/lib/libQt5WebKit.so.5.3.2: undefined reference to `gst_stream_volume_get_volume'
> /home/ss/Qt/5.3/gcc_64/lib/libQt5WebKit.so.5.3.2: undefined reference to `gst_message_type_get_name'
> /home/ss/Qt/5.3/gcc_64/lib/libQt5WebKit.so.5.3.2: undefined reference to `gst_missing_element_message_new'
> /home/ss/Qt/5.3/gcc_64/lib/libQt5WebKit.so.5.3.2: undefined reference to `gst_tag_list_is_empty'
> /home/ss/Qt/5.3/gcc_64/lib/libQt5WebKit.so.5.3.2: undefined reference to `gst_bus_add_signal_watch'
> /home/ss/Qt/5.3/gcc_64/lib/libQt5WebKit.so.5.3.2: undefined reference to `gst_pad_query'
> /home/ss/Qt/5.3/gcc_64/lib/libQt5WebKit.so.5.3.2: undefined reference to `gst_uri_handler_set_uri'
> /home/ss/Qt/5.3/gcc_64/lib/libQt5WebKit.so.5.3.2: undefined reference to `gst_video_parse_caps_pixel_aspect_ratio'
> /home/ss/Qt/5.3/gcc_64/lib/libQt5WebKit.so.5.3.2: undefined reference to `gst_app_src_set_stream_type'
> /home/ss/Qt/5.3/gcc_64/lib/libQt5WebKit.so.5.3.2: undefined reference to `gst_buffer_try_new_and_alloc'
> /home/ss/Qt/5.3/gcc_64/lib/libQt5WebKit.so.5.3.2: undefined reference to `gst_iterator_next'
> /home/ss/Qt/5.3/gcc_64/lib/libQt5WebKit.so.5.3.2: undefined reference to `gst_element_register'
> /home/ss/Qt/5.3/gcc_64/lib/libQt5WebKit.so.5.3.2: undefined reference to `gst_structure_new'
> /home/ss/Qt/5.3/gcc_64/lib/libQt5WebKit.so.5.3.2: undefined reference to `gst_element_state_change_return_get_name'
> /home/ss/Qt/5.3/gcc_64/lib/libQt5WebKit.so.5.3.2: undefined reference to `gst_object_get_type'
> /home/ss/Qt/5.3/gcc_64/lib/libQt5WebKit.so.5.3.2: undefined reference to `__gst_debug_min'
> /home/ss/Qt/5.3/gcc_64/lib/libQt5WebKit.so.5.3.2: undefined reference to `gst_pad_query_duration'
> /home/ss/Qt/5.3/gcc_64/lib/libQt5WebKit.so.5.3.2: undefined reference to `gst_pad_push_event'
> /home/ss/Qt/5.3/gcc_64/lib/libQt5WebKit.so.5.3.2: undefined reference to `gst_element_get_state'
> /home/ss/Qt/5.3/gcc_64/lib/libQt5WebKit.so.5.3.2: undefined reference to `gst_message_new_duration'
> /home/ss/Qt/5.3/gcc_64/lib/libQt5WebKit.so.5.3.2: undefined reference to `gst_format_get_name'
> /home/ss/Qt/5.3/gcc_64/lib/libQt5WebKit.so.5.3.2: undefined reference to `gst_element_factory_get_type'
> /home/ss/Qt/5.3/gcc_64/lib/libQt5WebKit.so.5.3.2: undefined reference to `gst_structure_get_name'
> /home/ss/Qt/5.3/gcc_64/lib/libQt5WebKit.so.5.3.2: undefined reference to `_gst_element_error_printf'
> /home/ss/Qt/5.3/gcc_64/lib/libQt5WebKit.so.5.3.2: undefined reference to `gst_element_found_tags_for_pad'
> /home/ss/Qt/5.3/gcc_64/lib/libQt5WebKit.so.5.3.2: undefined reference to `gst_element_release_request_pad'
> /home/ss/Qt/5.3/gcc_64/lib/libQt5WebKit.so.5.3.2: undefined reference to `gst_caps_ref'
> /home/ss/Qt/5.3/gcc_64/lib/libQt5WebKit.so.5.3.2: undefined reference to `gst_element_unlink_many'
> /home/ss/Qt/5.3/gcc_64/lib/libQt5WebKit.so.5.3.2: undefined reference to `gst_element_get_type'
> /home/ss/Qt/5.3/gcc_64/lib/libQt5WebKit.so.5.3.2: undefined reference to `gst_value_list_get_value'
> /home/ss/Qt/5.3/gcc_64/lib/libQt5WebKit.so.5.3.2: undefined reference to `gst_plugin_feature_get_type'
> /home/ss/Qt/5.3/gcc_64/lib/libQt5WebKit.so.5.3.2: undefined reference to `gst_debug_log'
> /home/ss/Qt/5.3/gcc_64/lib/libQt5WebKit.so.5.3.2: undefined reference to `gst_query_parse_duration'
> /home/ss/Qt/5.3/gcc_64/lib/libQt5WebKit.so.5.3.2: undefined reference to `gst_element_state_get_name'
> /home/ss/Qt/5.3/gcc_64/lib/libQt5WebKit.so.5.3.2: undefined reference to `gst_video_sink_get_type'
> /home/ss/Qt/5.3/gcc_64/lib/libQt5WebKit.so.5.3.2: undefined reference to `gst_caps_new_simple'
> /home/ss/Qt/5.3/gcc_64/lib/libQt5WebKit.so.5.3.2: undefined reference to `gst_ghost_pad_get_target'
> /home/ss/Qt/5.3/gcc_64/lib/libQt5WebKit.so.5.3.2: undefined reference to `gst_bin_new'
> /home/ss/Qt/5.3/gcc_64/lib/libQt5WebKit.so.5.3.2: undefined reference to `gst_query_set_uri'
> /home/ss/Qt/5.3/gcc_64/lib/libQt5WebKit.so.5.3.2: undefined reference to `gst_caps_replace'
> /home/ss/Qt/5.3/gcc_64/lib/libQt5WebKit.so.5.3.2: undefined reference to `gst_util_uint64_scale_int'
> /home/ss/Qt/5.3/gcc_64/lib/libQt5WebKit.so.5.3.2: undefined reference to `gst_bus_remove_signal_watch'
> /home/ss/Qt/5.3/gcc_64/lib/libQt5WebKit.so.5.3.2: undefined reference to `gst_pad_set_query_function'
> /home/ss/Qt/5.3/gcc_64/lib/libQt5WebKit.so.5.3.2: undefined reference to `_gst_debug_category_new'
> /home/ss/Qt/5.3/gcc_64/lib/libQt5WebKit.so.5.3.2: undefined reference to `gst_structure_has_name'
> /home/ss/Qt/5.3/gcc_64/lib/libQt5WebKit.so.5.3.2: undefined reference to `gst_structure_get_value'
> /home/ss/Qt/5.3/gcc_64/lib/libQt5WebKit.so.5.3.2: undefined reference to `gst_bus_sync_signal_handler'
> /home/ss/Qt/5.3/gcc_64/lib/libQt5WebKit.so.5.3.2: undefined reference to `gst_init_check'
> /home/ss/Qt/5.3/gcc_64/lib/libQt5WebKit.so.5.3.2: undefined reference to `gst_caps_is_fixed'
> /home/ss/Qt/5.3/gcc_64/lib/libQt5WebKit.so.5.3.2: undefined reference to `gst_video_format_parse_caps'
> /home/ss/Qt/5.3/gcc_64/lib/libQt5WebKit.so.5.3.2: undefined reference to `gst_value_get_mini_object'
> /home/ss/Qt/5.3/gcc_64/lib/libQt5WebKit.so.5.3.2: undefined reference to `gst_buffer_make_metadata_writable'
> /home/ss/Qt/5.3/gcc_64/lib/libQt5WebKit.so.5.3.2: undefined reference to `gst_query_parse_position'
> /home/ss/Qt/5.3/gcc_64/lib/libQt5WebKit.so.5.3.2: undefined reference to `gst_base_src_get_type'
> /home/ss/Qt/5.3/gcc_64/lib/libQt5WebKit.so.5.3.2: undefined reference to `gst_stream_volume_get_type'
> /home/ss/Qt/5.3/gcc_64/lib/libQt5WebKit.so.5.3.2: undefined reference to `gst_caps_unref'
> /home/ss/Qt/5.3/gcc_64/lib/libQt5WebKit.so.5.3.2: undefined reference to `gst_base_sink_get_type'
> /home/ss/Qt/5.3/gcc_64/lib/libQt5WebKit.so.5.3.2: undefined reference to `gst_stream_volume_set_volume'
> /home/ss/Qt/5.3/gcc_64/lib/libQt5WebKit.so.5.3.2: undefined reference to `gst_app_src_end_of_stream'
> /home/ss/Qt/5.3/gcc_64/lib/libQt5WebKit.so.5.3.2: undefined reference to `gst_structure_copy'
> /home/ss/Qt/5.3/gcc_64/lib/libQt5WebKit.so.5.3.2: undefined reference to `gst_object_sink'
> /home/ss/Qt/5.3/gcc_64/lib/libQt5WebKit.so.5.3.2: undefined reference to `gst_tag_list_new'
> /home/ss/Qt/5.3/gcc_64/lib/libQt5WebKit.so.5.3.2: undefined reference to `gst_element_set_state'
> /home/ss/Qt/5.3/gcc_64/lib/libQt5WebKit.so.5.3.2: undefined reference to `gst_resource_error_quark'
> /home/ss/Qt/5.3/gcc_64/lib/libQt5WebKit.so.5.3.2: undefined reference to `gst_ghost_pad_new'
> /home/ss/Qt/5.3/gcc_64/lib/libQt5WebKit.so.5.3.2: undefined reference to `gst_is_initialized'
> /home/ss/Qt/5.3/gcc_64/lib/libQt5WebKit.so.5.3.2: undefined reference to `gst_is_missing_plugin_message'
> /home/ss/Qt/5.3/gcc_64/lib/libQt5WebKit.so.5.3.2: undefined reference to `gst_object_unref'
> collect2: error: ld returned 1 exit status
> lang/CMakeFiles/sclang.dir/build.make:124: recipe for target 'lang/sclang' failed
> make[2]: *** [lang/sclang] Error 1
> CMakeFiles/Makefile2:3627: recipe for target 'lang/CMakeFiles/sclang.dir/all' failed
> make[1]: *** [lang/CMakeFiles/sclang.dir/all] Error 2
> Makefile:160: recipe for target 'all' failed
> make: *** [all] Error 2
>


_______________________________________________
sc-users mailing list

info (subscription, etc.): http://www.birmingham.ac.uk/facilities/ea-studios/research/supercollider/mailinglist.aspx
archive: http://www.listarc.bham.ac.uk/marchives/sc-users/
search: http://www.listarc.bham.ac.uk/lists/sc-users/search/
Reply | Threaded
Open this post in threaded view
|  
Report Content as Inappropriate

Re: Ubuntu build fail

tedthetrumpet
Not sure if I should take this to the developers list, but… it seems a shame that the only way to get the most recent version of SC on Linux is building from source. What is a ppa anyway? What would need to be done for there to be a ppa for version 3.8?

Just expanding a bit, this came up on the livecode.slack.com community the other day as well. While some people seem to find building from source straightforward, others – myself included! – find it a real struggle. Right now, I'm personally a bit stuck, as I don't want to move to 3.8 on my mac unless I can get it on my ubuntu machine as well, and I don't have time at the moment to face the torture of building from source.
--
J. Simon van der Walt
jsimonvanderwalt.com
twitter.com/tedthetrumpet
Reply | Threaded
Open this post in threaded view
|  
Report Content as Inappropriate

Re: Ubuntu build fail

John DeBlase
Lunar-lou, looks like maybe you're missing some library dependencies for QT5? 

I've built from source on Ubuntu a bunch of times recently.... try using this set of instructions. It works for me every time on 14.04LTS.. It takes about 15 minutes


On Sun, Jan 8, 2017 at 6:35 AM, tedthetrumpet <[hidden email]> wrote:
Not sure if I should take this to the developers list, but… it seems a shame
that the only way to get the most recent version of SC on Linux is building
from source. What is a ppa anyway? What would need to be done for there to
be a ppa for version 3.8?

Just expanding a bit, this came up on the livecode.slack.com community the
other day as well. While some people seem to find building from source
straightforward, others – myself included! – find it a real struggle. Right
now, I'm personally a bit stuck, as I don't want to move to 3.8 on my mac
unless I can get it on my ubuntu machine as well, and I don't have time at
the moment to face the torture of building from source.



-----
--
J. Simon van der Walt
jsimonvanderwalt.com
twitter.com/tedthetrumpet
--
View this message in context: http://new-supercollider-mailing-lists-forums-use-these.2681727.n2.nabble.com/Ubuntu-build-fail-tp7630016p7630024.html
Sent from the SuperCollider Users New (Use this!!!!) mailing list archive at Nabble.com.

_______________________________________________
sc-users mailing list

info (subscription, etc.): http://www.birmingham.ac.uk/facilities/ea-studios/research/supercollider/mailinglist.aspx
archive: http://www.listarc.bham.ac.uk/marchives/sc-users/
search: http://www.listarc.bham.ac.uk/lists/sc-users/search/

Reply | Threaded
Open this post in threaded view
|  
Report Content as Inappropriate

Re: Ubuntu build fail

lunar-lou
I'll try that and keep you updated. 

I built mpv player the other day (polishes finger nails, not too shabby).. compiling isn't usually that difficult, but SC always is a pain. Never done it successfully


On Sun, Jan 8, 2017 at 10:26 AM, John DeBlase <[hidden email]> wrote:
Lunar-lou, looks like maybe you're missing some library dependencies for QT5? 

I've built from source on Ubuntu a bunch of times recently.... try using this set of instructions. It works for me every time on 14.04LTS.. It takes about 15 minutes


On Sun, Jan 8, 2017 at 6:35 AM, tedthetrumpet <[hidden email]> wrote:
Not sure if I should take this to the developers list, but… it seems a shame
that the only way to get the most recent version of SC on Linux is building
from source. What is a ppa anyway? What would need to be done for there to
be a ppa for version 3.8?

Just expanding a bit, this came up on the livecode.slack.com community the
other day as well. While some people seem to find building from source
straightforward, others – myself included! – find it a real struggle. Right
now, I'm personally a bit stuck, as I don't want to move to 3.8 on my mac
unless I can get it on my ubuntu machine as well, and I don't have time at
the moment to face the torture of building from source.

Reply | Threaded
Open this post in threaded view
|  
Report Content as Inappropriate

Re: Ubuntu build fail

Iain Mott-2

Hi - i didn't really study the compilation print out you posted, but did you install all the debian dependencies listed in the linux readme file with the source code? I did that recently with ubuntu 16.04 and it built OK. After that I followed these instructions to install the plugins: https://github.com/supercollider/supercollider/wiki/Installing-SuperCollider-on-Ubuntu-systems

iain


Em 08/01/2017 13:57, lunar-lou escreveu:
I'll try that and keep you updated. 

I built mpv player the other day (polishes finger nails, not too shabby).. compiling isn't usually that difficult, but SC always is a pain. Never done it successfully


On Sun, Jan 8, 2017 at 10:26 AM, John DeBlase [hidden email] wrote:
Lunar-lou, looks like maybe you're missing some library dependencies for QT5? 

I've built from source on Ubuntu a bunch of times recently.... try using this set of instructions. It works for me every time on 14.04LTS.. It takes about 15 minutes


On Sun, Jan 8, 2017 at 6:35 AM, tedthetrumpet <[hidden email]> wrote:
Not sure if I should take this to the developers list, but… it seems a shame
that the only way to get the most recent version of SC on Linux is building
from source. What is a ppa anyway? What would need to be done for there to
be a ppa for version 3.8?

Just expanding a bit, this came up on the livecode.slack.com community the
other day as well. While some people seem to find building from source
straightforward, others – myself included! – find it a real struggle. Right
now, I'm personally a bit stuck, as I don't want to move to 3.8 on my mac
unless I can get it on my ubuntu machine as well, and I don't have time at
the moment to face the torture of building from source.


-- 
_________
Iain Mott
http://escuta.org
Reply | Threaded
Open this post in threaded view
|  
Report Content as Inappropriate

Re: Ubuntu build fail

lunar-lou
Johns link helped greatly. 
Got 3.9dev running!

 I had to point to certain things unique to my system.  In the end i used,
cmake -DSC_ED=OFF -DSC_EL=OFF -DSC_WII=OFF -DSC_VIM=OFF -DSC_IDE=ON -DCMAKE_PREFIX_PATH=/home/ss/Qt/5.3/gcc_64 -DCMAKE_PREFIX_PATH=/usr/lib/x86_64-linux-gnu/ ..

apt-file search helped a lot in finding lib locations

thank!
x
Reply | Threaded
Open this post in threaded view
|  
Report Content as Inappropriate

Re: Ubuntu build fail

x
by the way does your 'cmd-.' or 'cmd-q' work?
my fresh ubuntu-3.9dev build works fine except for the shortcuts..



On Jan 8, 2017, at 10:52 PM, lunar-lou <[hidden email]> wrote:

> Johns link helped greatly.
> Got 3.9dev running!
>
>  I had to point to certain things unique to my system.  In the end i used,
> cmake -DSC_ED=OFF -DSC_EL=OFF -DSC_WII=OFF -DSC_VIM=OFF -DSC_IDE=ON -DCMAKE_PREFIX_PATH=/home/ss/Qt/5.3/gcc_64 -DCMAKE_PREFIX_PATH=/usr/lib/x86_64-linux-gnu/ ..
>
> apt-file search helped a lot in finding lib locations
>
> thank!


signature.asc (859 bytes) Download Attachment
Reply | Threaded
Open this post in threaded view
|  
Report Content as Inappropriate

Re: Ubuntu build fail

lunar-lou
f.zett, Yes.

Is there a way to glabally set sounds folder?

Also, is buffer deprecated?

thnks


On Sun, Jan 8, 2017 at 4:59 PM, f.zett <[hidden email]> wrote:
by the way does your 'cmd-.' or 'cmd-q' work? my fresh ubuntu-3.9dev build works fine except for the shortcuts..

Reply | Threaded
Open this post in threaded view
|  
Report Content as Inappropriate

Re: Ubuntu build fail

lunar-lou
never mind on the buffer
Reply | Threaded
Open this post in threaded view
|  
Report Content as Inappropriate

Re: Ubuntu build fail

5tefan
In reply to this post by lunar-lou


Am 2017-01-08 um 23:06 schrieb lunar-lou:
> f.zett, Yes.
>
> Is there a way to glabally set sounds folder?

Ideally put a line like the following in your startup file:

thisProcess.platform.recordingsDir_("/path/to/my/recordings");

hth, Stefan

_______________________________________________
sc-users mailing list

info (subscription, etc.): http://www.birmingham.ac.uk/facilities/ea-studios/research/supercollider/mailinglist.aspx
archive: http://www.listarc.bham.ac.uk/marchives/sc-users/
search: http://www.listarc.bham.ac.uk/lists/sc-users/search/
Reply | Threaded
Open this post in threaded view
|  
Report Content as Inappropriate

Re: Ubuntu build fail

lunar-lou
great, thank you


On Sun, Jan 8, 2017 at 6:41 PM, Stefan Nussbaumer <[hidden email]> wrote:
Am 2017-01-08 um 23:06 schrieb lunar-lou:
f.zett, Yes. Is there a way to glabally set sounds folder?
Ideally put a line like the following in your startup file: thisProcess.platform.recordingsDir_("/path/to/my/recordings"); hth, Stefan _______________________________________________ sc-users mailing list info (subscription, etc.): http://www.birmingham.ac.uk/facilities/ea-studios/research/supercollider/mailinglist.aspx archive: http://www.listarc.bham.ac.uk/marchives/sc-users/ search: http://www.listarc.bham.ac.uk/lists/sc-users/search/


Reply | Threaded
Open this post in threaded view
|  
Report Content as Inappropriate

Re: Ubuntu build fail

lunar-lou
Maybe adding buttons on the titlebar like run, stop, anything. ( maybe user defined) for us lazy people would be nice
Reply | Threaded
Open this post in threaded view
|  
Report Content as Inappropriate

Re: Ubuntu build fail

John DeBlase
Glad I could help!

> On Jan 8, 2017, at 10:36 PM, lunar-lou <[hidden email]> wrote:
>
> Maybe adding buttons on the titlebar like run, stop, anything. ( maybe user defined) for us lazy people would be nice

_______________________________________________
sc-users mailing list

info (subscription, etc.): http://www.birmingham.ac.uk/facilities/ea-studios/research/supercollider/mailinglist.aspx
archive: http://www.listarc.bham.ac.uk/marchives/sc-users/
search: http://www.listarc.bham.ac.uk/lists/sc-users/search/
Reply | Threaded
Open this post in threaded view
|  
Report Content as Inappropriate

Re: Ubuntu build fail

5tefan
In reply to this post by lunar-lou


Am 2017-01-09 um 04:36 schrieb lunar-lou:
> Maybe adding buttons on the titlebar like run, stop, anything. ( maybe
> user defined) for us lazy people would be nice
>

Maybe it's not exactly obvious: In your IDE's bottom bar you find the
indicator of the current server activity (a black field with some
numbers). Click on that and a popup menu with what you're looking for
should open.

hth, Stefan

_______________________________________________
sc-users mailing list

info (subscription, etc.): http://www.birmingham.ac.uk/facilities/ea-studios/research/supercollider/mailinglist.aspx
archive: http://www.listarc.bham.ac.uk/marchives/sc-users/
search: http://www.listarc.bham.ac.uk/lists/sc-users/search/
Reply | Threaded
Open this post in threaded view
|  
Report Content as Inappropriate

Re: Ubuntu build fail

lunar-lou
Oh good. Yeah, I never would have thought to click there


On Mon, Jan 9, 2017 at 6:34 AM, Stefan Nussbaumer <[hidden email]> wrote:
Am 2017-01-09 um 04:36 schrieb lunar-lou:
Maybe adding buttons on the titlebar like run, stop, anything. ( maybe user defined) for us lazy people would be nice
Maybe it's not exactly obvious: In your IDE's bottom bar you find the indicator of the current server activity (a black field with some numbers). Click on that and a popup menu with what you're looking for should open. hth, Stefan _______________________________________________ sc-users mailing list info (subscription, etc.): http://www.birmingham.ac.uk/facilities/ea-studios/research/supercollider/mailinglist.aspx archive: http://www.listarc.bham.ac.uk/marchives/sc-users/ search: http://www.listarc.bham.ac.uk/lists/sc-users/search/


Reply | Threaded
Open this post in threaded view
|  
Report Content as Inappropriate

Re: Ubuntu build fail

lunar-lou
Im using Elementary OS ubuntu based I get a real time error from SC w/ jack. I can use SC and im afraid fiddling with the kernel will render me with no OS. Any Ubuntu users know a clear work around?
Reply | Threaded
Open this post in threaded view
|  
Report Content as Inappropriate

Re: Ubuntu build fail

patrick

No need to worry! You probably just need to configure your system to allow Jack to use realtime scheduling. Often, all you have to do is add your user to a group called audio, and re-login to you system. See the jack FAQ here: http://jackaudio.org/faq/linux_rt_config.html

jackaudio.org
How do I configure my linux system to allow JACK to use realtime scheduling? Realtime (RT) scheduling is a feature of all Linux operating systems that enables an ...
Cheers,

Patrick




From: [hidden email] <[hidden email]> on behalf of lunar-lou <[hidden email]>
Sent: January 9, 2017 9:20 PM
To: [hidden email]
Subject: Re: [sc-users] Re: Ubuntu build fail
 
Im using Elementary OS ubuntu based I get a real time error from SC w/ jack. I can use SC and im afraid fiddling with the kernel will render me with no OS. Any Ubuntu users know a clear work around?
Reply | Threaded
Open this post in threaded view
|  
Report Content as Inappropriate

Re: Ubuntu build fail

lunar-lou
thanks!


On Mon, Jan 9, 2017 at 9:27 PM, P Dupuis <[hidden email]> wrote:

No need to worry! You probably just need to configure your system to allow Jack to use realtime scheduling. Often, all you have to do is add your user to a group called audio, and re-login to you system. See the jack FAQ here: http://jackaudio.org/faq/linux_rt_config.html

jackaudio.org
How do I configure my linux system to allow JACK to use realtime scheduling? Realtime (RT) scheduling is a feature of all Linux operating systems that enables an ...

Loading...